{"text_format":"1","workbook":"xlsx","n_sheets":3,"sheets":["AUX","DASHBOARD B","RESULTS B"],"not_rendered":{"charts":2,"images":2,"macros":1,"external_links":0,"defined_names":1,"comments":1,"pivot_tables":0},"unopened":[],"bounds":{"document_bytes":16777216,"sheet_cells":100000,"rows_first":2000,"rows_last":500,"rows_between":2000,"halvings":0,"cell_chars":16384,"cell_head_chars":4096},"cells_cut":0,"cells_raw":0,"read":"whole","date_system":"1900"}

{"sheet":"AUX","index":0,"n_rows":38,"n_cols":2,"rows_kept":38,"cut":false,"hidden":true,"merged":[]}
["NUMBER","COLOR"]
[0,0]
[1,"RED"]
[2,"BLACK"]
[3,"RED"]
[4,"BLACK"]
[5,"RED"]
[6,"BLACK"]
[7,"RED"]
[8,"BLACK"]
[9,"RED"]
[10,"BLACK"]
[11,"RED"]
[12,"BLACK"]
[13,"RED"]
[14,"BLACK"]
[15,"RED"]
[16,"BLACK"]
[17,"RED"]
[18,"BLACK"]
[19,"RED"]
[20,"BLACK"]
[21,"RED"]
[22,"BLACK"]
[23,"RED"]
[24,"BLACK"]
[25,"RED"]
[26,"BLACK"]
[27,"RED"]
[28,"BLACK"]
[29,"RED"]
[30,"BLACK"]
[31,"RED"]
[32,"BLACK"]
[33,"RED"]
[34,"BLACK"]
[35,"RED"]
[36,"BLACK"]

{"sheet":"DASHBOARD B","index":1,"n_rows":300,"n_cols":38,"rows_kept":300,"cut":false,"hidden":false,"merged":[[0,3,1,3],[0,4,1,4],[0,6,1,6],[0,8,1,8],[0,9,1,9],[0,7,1,7]]}
[null,null,null,"INITIAL BALANCE","BET AFTER ITERATIONS",null,"STOP LOSS ROUND","STOP\nPROFIT €","MAX ITERATIONS",null,null,null,null,null,null,null,null,null,null,0,1,2,3,4,5,6,7,8,9,10,11,12,13,14,15,16,17,18]
[null,null,null,null,null,"BET",null,null,null,null,"WIN","€ WIN","LOSS","€ LOSS","€ BAL",null,null,null,null,{"$f":"COUNTIF($B:$B,T1)","v":8},8,6,12,14,8,5,8,6,12,15,7,8,11,7,2,8,6,8]
[null,null,null,300,1,5,1,200,{"$f":"E3+G3","v":2},null,{"$f":"COUNTIF(H:H,\"SUCCESS\")","v":68},{"$f":"K3*F3","v":340},{"$f":"COUNTIFS(H:H,\"FAIL\",I:I,G4)","v":75},{"$f":"G5*M3","v":375},{"$f":"L3-N3","v":-35},null,null,null,null,null,19,20,21,22,23,24,25,26,27,28,29,30,31,32,33,34,35,36]
[null,null,null,null,null,null,{"$f":"F3*2^(G3-1)","v":5},"CALC",{"$f":"MAX($E$7:$E$300)","v":9},null,null,null,null,null,null,null,null,null,null,null,{"$f":"COUNTIF($B:$B,U3)","v":8},6,6,6,6,8,8,8,10,2,3,7,8,9,11,10,9,10]
[null,null,null,null,null,null,{"$f":"G4*2-F3","v":5},"LOSS"]
["AUX ROW","RESULT","COLOR","SIM ZERO","ITERATIONS","BET","BET SIGN","RESULT","BET AM","WIN","BALANCE","STOPPER","IT CONT","IT ISOL",null,"ITER","TIMES","ISOL TIM"]
[{"$f":"ROW()","v":7},{"$f":"RANDBETWEEN(0,36)","v":21},{"$f":"_xlfn.XLOOKUP(B7,AUX!$A:$A,AUX!$B:$B,\"\",0,1)","v":"RED"},{"$f":"IF(C7=0,INDEX($C:$C,MAX(_xlfn.XLOOKUP(\"BLACK\",$C$7:C7,$A$7:A7,\"\",0,-1),_xlfn.XLOOKUP(\"RED\",$C$7:C7,$A$7:A7,\"\",0,-1)),1),C7)","v":"RED"},null,null,null,null,null,null,{"$f":"D3","v":300},null,{"$f":"E7*20","v":0},{"$f":"IF(E8<=E7,E7,\"\")","v":""},null,0,{"$f":"COUNTIF($E$7:$E$300,P7)","v":0},{"$f":"COUNTIF($N$7:$N$300,P7)","v":0}]
[{"$f":"ROW()","v":8},{"$f":"RANDBETWEEN(0,36)","v":24},{"$f":"_xlfn.XLOOKUP(B8,AUX!$A:$A,AUX!$B:$B,\"\",0,1)","v":"BLACK"},{"$f":"IF(C8=0,INDEX($C:$C,MAX(_xlfn.XLOOKUP(\"BLACK\",$C$7:C8,$A$7:A8,\"\",0,-1),_xlfn.XLOOKUP(\"RED\",$C$7:C8,$A$7:A8,\"\",0,-1)),1),C8)","v":"BLACK"},{"$f":"IF(AND(COUNTIF($D$7:D8,\"RED\")>0,COUNTIF($D$7:D8,\"BLACK\")>0),A8-MIN(_xlfn.XLOOKUP(\"BLACK\",$D$7:D8,$A$7:A8,\"\",0,-1),_xlfn.XLOOKUP(\"RED\",$D$7:D8,$A$7:A8,\"\",0,-1)),A8-6)","v":1},{"$f":"IF(AND(E7>=$E$3,L7=\"\"),\"BET\",\"\")","v":""},{"$f":"IF(F8=\"BET\",IF(D7=\"RED\",\"BLACK\",IF(D7=\"BLACK\",\"RED\",\"ERROR\")),\"\")","v":""},{"$f":"IF(F8=\"BET\",IF(D8=G8,\"SUCCESS\",\"FAIL\"),\"\")","v":""},{"$f":"IF(F8=\"BET\",IF(OR(I7>=$G$4,F7=\"\"),$F$3,IF(AND(F7=\"BET\",H7=\"FAIL\"),I7*2,$F$3)),\"\")","v":""},{"$f":"IF(F8=\"BET\",IF(H8=\"SUCCESS\",I8*2,0),\"\")","v":""},{"$f":"IF(F8=\"BET\",K7-I8+J8,K7)","v":300},{"$f":"IF(OR(AND(H8=\"FAIL\",I8=$G$4),AND(L7=\"STOP\",E8>$E$3)),\"STOP\",\"\")","v":""},{"$f":"E8*50","v":50},{"$f":"IF(E9<=E8,E8,\"\")","v":1},null,1,{"$f":"COUNTIF(E:E,P8)","v":145},{"$f":"COUNTIF($N$7:$N$300,P8)","v":69}]
[{"$f":"ROW()","v":9},23,{"$f":"_xlfn.XLOOKUP(B9,AUX!$A:$A,AUX!$B:$B,\"\",0,1)","v":"RED"},{"$f":"IF(C9=0,INDEX($C:$C,MAX(_xlfn.XLOOKUP(\"BLACK\",$C$7:C9,$A$7:A9,\"\",0,-1),_xlfn.XLOOKUP(\"RED\",$C$7:C9,$A$7:A9,\"\",0,-1)),1),C9)","v":"RED"},{"$f":"IF(AND(COUNTIF($D$7:D9,\"RED\")>0,COUNTIF($D$7:D9,\"BLACK\")>0),A9-MIN(_xlfn.XLOOKUP(\"BLACK\",$D$7:D9,$A$7:A9,\"\",0,-1),_xlfn.XLOOKUP(\"RED\",$D$7:D9,$A$7:A9,\"\",0,-1)),A9-6)","v":1},{"$f":"IF(AND(E8>=$E$3,L8=\"\"),\"BET\",\"\")","v":"BET"},{"$f":"IF(F9=\"BET\",IF(D8=\"RED\",\"BLACK\",IF(D8=\"BLACK\",\"RED\",\"ERROR\")),\"\")","v":"RED"},{"$f":"IF(F9=\"BET\",IF(D9=G9,\"SUCCESS\",\"FAIL\"),\"\")","v":"SUCCESS"},{"$f":"IF(F9=\"BET\",IF(OR(I8>=$G$4,F8=\"\"),$F$3,IF(AND(F8=\"BET\",H8=\"FAIL\"),I8*2,$F$3)),\"\")","v":5},10,305,"",{"$f":"E9*50","v":50},1,null,2,{"$f":"COUNTIF(E:E,P9)","v":75},35]
[{"$f":"ROW()","v":10},4,{"$f":"_xlfn.XLOOKUP(B10,AUX!$A:$A,AUX!$B:$B,\"\",0,1)","v":"BLACK"},{"$f":"IF(C10=0,INDEX($C:$C,MAX(_xlfn.XLOOKUP(\"BLACK\",$C$7:C10,$A$7:A10,\"\",0,-1),_xlfn.XLOOKUP(\"RED\",$C$7:C10,$A$7:A10,\"\",0,-1)),1),C10)","v":"BLACK"},{"$f":"IF(AND(COUNTIF($D$7:D10,\"RED\")>0,COUNTIF($D$7:D10,\"BLACK\")>0),A10-MIN(_xlfn.XLOOKUP(\"BLACK\",$D$7:D10,$A$7:A10,\"\",0,-1),_xlfn.XLOOKUP(\"RED\",$D$7:D10,$A$7:A10,\"\",0,-1)),A10-6)","v":1},"BET",{"$f":"IF(F10=\"BET\",IF(D9=\"RED\",\"BLACK\",IF(D9=\"BLACK\",\"RED\",\"ERROR\")),\"\")","v":"BLACK"},{"$f":"IF(F10=\"BET\",IF(D10=G10,\"SUCCESS\",\"FAIL\"),\"\")","v":"SUCCESS"},{"$f":"IF(F10=\"BET\",IF(OR(I9>=$G$4,F9=\"\"),$F$3,IF(AND(F9=\"BET\",H9=\"FAIL\"),I9*2,$F$3)),\"\")","v":5},{"$f":"IF(F10=\"BET\",IF(H10=\"SUCCESS\",I10*2,0),\"\")","v":10},310,"",50,1,null,3,{"$f":"COUNTIF(E:E,P10)","v":40},20]
[{"$f":"ROW()","v":11},13,{"$f":"_xlfn.XLOOKUP(B11,AUX!$A:$A,AUX!$B:$B,\"\",0,1)","v":"RED"},{"$f":"IF(C11=0,INDEX($C:$C,MAX(_xlfn.XLOOKUP(\"BLACK\",$C$7:C11,$A$7:A11,\"\",0,-1),_xlfn.XLOOKUP(\"RED\",$C$7:C11,$A$7:A11,\"\",0,-1)),1),C11)","v":"RED"},{"$f":"IF(AND(COUNTIF($D$7:D11,\"RED\")>0,COUNTIF($D$7:D11,\"BLACK\")>0),A11-MIN(_xlfn.XLOOKUP(\"BLACK\",$D$7:D11,$A$7:A11,\"\",0,-1),_xlfn.XLOOKUP(\"RED\",$D$7:D11,$A$7:A11,\"\",0,-1)),A11-6)","v":1},"BET","RED","SUCCESS",5,10,315,"",50,"",null,4,{"$f":"COUNTIF(E:E,P11)","v":20},11]
[{"$f":"ROW()","v":12},3,{"$f":"_xlfn.XLOOKUP(B12,AUX!$A:$A,AUX!$B:$B,\"\",0,1)","v":"RED"},{"$f":"IF(C12=0,INDEX($C:$C,MAX(_xlfn.XLOOKUP(\"BLACK\",$C$7:C12,$A$7:A12,\"\",0,-1),_xlfn.XLOOKUP(\"RED\",$C$7:C12,$A$7:A12,\"\",0,-1)),1),C12)","v":"RED"},{"$f":"IF(AND(COUNTIF($D$7:D12,\"RED\")>0,COUNTIF($D$7:D12,\"BLACK\")>0),A12-MIN(_xlfn.XLOOKUP(\"BLACK\",$D$7:D12,$A$7:A12,\"\",0,-1),_xlfn.XLOOKUP(\"RED\",$D$7:D12,$A$7:A12,\"\",0,-1)),A12-6)","v":2},"BET","BLACK","FAIL",5,0,310,"STOP",100,"",null,5,{"$f":"COUNTIF(E:E,P12)","v":9},7]
[{"$f":"ROW()","v":13},3,{"$f":"_xlfn.XLOOKUP(B13,AUX!$A:$A,AUX!$B:$B,\"\",0,1)","v":"RED"},{"$f":"IF(C13=0,INDEX($C:$C,MAX(_xlfn.XLOOKUP(\"BLACK\",$C$7:C13,$A$7:A13,\"\",0,-1),_xlfn.XLOOKUP(\"RED\",$C$7:C13,$A$7:A13,\"\",0,-1)),1),C13)","v":"RED"},{"$f":"IF(AND(COUNTIF($D$7:D13,\"RED\")>0,COUNTIF($D$7:D13,\"BLACK\")>0),A13-MIN(_xlfn.XLOOKUP(\"BLACK\",$D$7:D13,$A$7:A13,\"\",0,-1),_xlfn.XLOOKUP(\"RED\",$D$7:D13,$A$7:A13,\"\",0,-1)),A13-6)","v":3},"","","","","",310,"STOP",150,3,null,6,{"$f":"COUNTIF(E:E,P13)","v":2},1]
[{"$f":"ROW()","v":14},2,{"$f":"_xlfn.XLOOKUP(B14,AUX!$A:$A,AUX!$B:$B,\"\",0,1)","v":"BLACK"},{"$f":"IF(C14=0,INDEX($C:$C,MAX(_xlfn.XLOOKUP(\"BLACK\",$C$7:C14,$A$7:A14,\"\",0,-1),_xlfn.XLOOKUP(\"RED\",$C$7:C14,$A$7:A14,\"\",0,-1)),1),C14)","v":"BLACK"},{"$f":"IF(AND(COUNTIF($D$7:D14,\"RED\")>0,COUNTIF($D$7:D14,\"BLACK\")>0),A14-MIN(_xlfn.XLOOKUP(\"BLACK\",$D$7:D14,$A$7:A14,\"\",0,-1),_xlfn.XLOOKUP(\"RED\",$D$7:D14,$A$7:A14,\"\",0,-1)),A14-6)","v":1},"","","","","",310,"",50,1,null,7,{"$f":"COUNTIF(E:E,P14)","v":1},0]
[{"$f":"ROW()","v":15},1,{"$f":"_xlfn.XLOOKUP(B15,AUX!$A:$A,AUX!$B:$B,\"\",0,1)","v":"RED"},{"$f":"IF(C15=0,INDEX($C:$C,MAX(_xlfn.XLOOKUP(\"BLACK\",$C$7:C15,$A$7:A15,\"\",0,-1),_xlfn.XLOOKUP(\"RED\",$C$7:C15,$A$7:A15,\"\",0,-1)),1),C15)","v":"RED"},{"$f":"IF(AND(COUNTIF($D$7:D15,\"RED\")>0,COUNTIF($D$7:D15,\"BLACK\")>0),A15-MIN(_xlfn.XLOOKUP(\"BLACK\",$D$7:D15,$A$7:A15,\"\",0,-1),_xlfn.XLOOKUP(\"RED\",$D$7:D15,$A$7:A15,\"\",0,-1)),A15-6)","v":1},"BET","RED","SUCCESS",5,10,315,"",50,1,null,8,{"$f":"COUNTIF(E:E,P15)","v":1},0]
[{"$f":"ROW()","v":16},10,{"$f":"_xlfn.XLOOKUP(B16,AUX!$A:$A,AUX!$B:$B,\"\",0,1)","v":"BLACK"},{"$f":"IF(C16=0,INDEX($C:$C,MAX(_xlfn.XLOOKUP(\"BLACK\",$C$7:C16,$A$7:A16,\"\",0,-1),_xlfn.XLOOKUP(\"RED\",$C$7:C16,$A$7:A16,\"\",0,-1)),1),C16)","v":"BLACK"},{"$f":"IF(AND(COUNTIF($D$7:D16,\"RED\")>0,COUNTIF($D$7:D16,\"BLACK\")>0),A16-MIN(_xlfn.XLOOKUP(\"BLACK\",$D$7:D16,$A$7:A16,\"\",0,-1),_xlfn.XLOOKUP(\"RED\",$D$7:D16,$A$7:A16,\"\",0,-1)),A16-6)","v":1},"BET","BLACK","SUCCESS",5,10,320,"",50,1,null,9,{"$f":"COUNTIF(E:E,P16)","v":1},1]
[{"$f":"ROW()","v":17},35,{"$f":"_xlfn.XLOOKUP(B17,AUX!$A:$A,AUX!$B:$B,\"\",0,1)","v":"RED"},{"$f":"IF(C17=0,INDEX($C:$C,MAX(_xlfn.XLOOKUP(\"BLACK\",$C$7:C17,$A$7:A17,\"\",0,-1),_xlfn.XLOOKUP(\"RED\",$C$7:C17,$A$7:A17,\"\",0,-1)),1),C17)","v":"RED"},{"$f":"IF(AND(COUNTIF($D$7:D17,\"RED\")>0,COUNTIF($D$7:D17,\"BLACK\")>0),A17-MIN(_xlfn.XLOOKUP(\"BLACK\",$D$7:D17,$A$7:A17,\"\",0,-1),_xlfn.XLOOKUP(\"RED\",$D$7:D17,$A$7:A17,\"\",0,-1)),A17-6)","v":1},"BET","RED","SUCCESS",5,10,325,"",50,"",null,10,{"$f":"COUNTIF(E:E,P17)","v":0},0]
[{"$f":"ROW()","v":18},5,{"$f":"_xlfn.XLOOKUP(B18,AUX!$A:$A,AUX!$B:$B,\"\",0,1)","v":"RED"},{"$f":"IF(C18=0,INDEX($C:$C,MAX(_xlfn.XLOOKUP(\"BLACK\",$C$7:C18,$A$7:A18,\"\",0,-1),_xlfn.XLOOKUP(\"RED\",$C$7:C18,$A$7:A18,\"\",0,-1)),1),C18)","v":"RED"},{"$f":"IF(AND(COUNTIF($D$7:D18,\"RED\")>0,COUNTIF($D$7:D18,\"BLACK\")>0),A18-MIN(_xlfn.XLOOKUP(\"BLACK\",$D$7:D18,$A$7:A18,\"\",0,-1),_xlfn.XLOOKUP(\"RED\",$D$7:D18,$A$7:A18,\"\",0,-1)),A18-6)","v":2},"BET","BLACK","FAIL",5,0,320,"STOP",100,"",null,11,{"$f":"COUNTIF(E:E,P18)","v":0},0]
[{"$f":"ROW()","v":19},23,{"$f":"_xlfn.XLOOKUP(B19,AUX!$A:$A,AUX!$B:$B,\"\",0,1)","v":"RED"},{"$f":"IF(C19=0,INDEX($C:$C,MAX(_xlfn.XLOOKUP(\"BLACK\",$C$7:C19,$A$7:A19,\"\",0,-1),_xlfn.XLOOKUP(\"RED\",$C$7:C19,$A$7:A19,\"\",0,-1)),1),C19)","v":"RED"},{"$f":"IF(AND(COUNTIF($D$7:D19,\"RED\")>0,COUNTIF($D$7:D19,\"BLACK\")>0),A19-MIN(_xlfn.XLOOKUP(\"BLACK\",$D$7:D19,$A$7:A19,\"\",0,-1),_xlfn.XLOOKUP(\"RED\",$D$7:D19,$A$7:A19,\"\",0,-1)),A19-6)","v":3},"","","","","",320,"STOP",150,3,null,12,{"$f":"COUNTIF(E:E,P19)","v":0},0]
[{"$f":"ROW()","v":20},26,{"$f":"_xlfn.XLOOKUP(B20,AUX!$A:$A,AUX!$B:$B,\"\",0,1)","v":"BLACK"},{"$f":"IF(C20=0,INDEX($C:$C,MAX(_xlfn.XLOOKUP(\"BLACK\",$C$7:C20,$A$7:A20,\"\",0,-1),_xlfn.XLOOKUP(\"RED\",$C$7:C20,$A$7:A20,\"\",0,-1)),1),C20)","v":"BLACK"},{"$f":"IF(AND(COUNTIF($D$7:D20,\"RED\")>0,COUNTIF($D$7:D20,\"BLACK\")>0),A20-MIN(_xlfn.XLOOKUP(\"BLACK\",$D$7:D20,$A$7:A20,\"\",0,-1),_xlfn.XLOOKUP(\"RED\",$D$7:D20,$A$7:A20,\"\",0,-1)),A20-6)","v":1},"","","","","",320,"",50,"",null,13,{"$f":"COUNTIF(E:E,P20)","v":0},0]
[{"$f":"ROW()","v":21},34,{"$f":"_xlfn.XLOOKUP(B21,AUX!$A:$A,AUX!$B:$B,\"\",0,1)","v":"BLACK"},{"$f":"IF(C21=0,INDEX($C:$C,MAX(_xlfn.XLOOKUP(\"BLACK\",$C$7:C21,$A$7:A21,\"\",0,-1),_xlfn.XLOOKUP(\"RED\",$C$7:C21,$A$7:A21,\"\",0,-1)),1),C21)","v":"BLACK"},{"$f":"IF(AND(COUNTIF($D$7:D21,\"RED\")>0,COUNTIF($D$7:D21,\"BLACK\")>0),A21-MIN(_xlfn.XLOOKUP(\"BLACK\",$D$7:D21,$A$7:A21,\"\",0,-1),_xlfn.XLOOKUP(\"RED\",$D$7:D21,$A$7:A21,\"\",0,-1)),A21-6)","v":2},"BET","RED","FAIL",5,0,315,"STOP",100,2,null,14,{"$f":"COUNTIF(E:E,P21)","v":0},0]
[{"$f":"ROW()","v":22},7,{"$f":"_xlfn.XLOOKUP(B22,AUX!$A:$A,AUX!$B:$B,\"\",0,1)","v":"RED"},{"$f":"IF(C22=0,INDEX($C:$C,MAX(_xlfn.XLOOKUP(\"BLACK\",$C$7:C22,$A$7:A22,\"\",0,-1),_xlfn.XLOOKUP(\"RED\",$C$7:C22,$A$7:A22,\"\",0,-1)),1),C22)","v":"RED"},{"$f":"IF(AND(COUNTIF($D$7:D22,\"RED\")>0,COUNTIF($D$7:D22,\"BLACK\")>0),A22-MIN(_xlfn.XLOOKUP(\"BLACK\",$D$7:D22,$A$7:A22,\"\",0,-1),_xlfn.XLOOKUP(\"RED\",$D$7:D22,$A$7:A22,\"\",0,-1)),A22-6)","v":1},"","","","","",315,"",50,1,null,15,{"$f":"COUNTIF(E:E,P22)","v":0},0]
[{"$f":"ROW()","v":23},28,{"$f":"_xlfn.XLOOKUP(B23,AUX!$A:$A,AUX!$B:$B,\"\",0,1)","v":"BLACK"},{"$f":"IF(C23=0,INDEX($C:$C,MAX(_xlfn.XLOOKUP(\"BLACK\",$C$7:C23,$A$7:A23,\"\",0,-1),_xlfn.XLOOKUP(\"RED\",$C$7:C23,$A$7:A23,\"\",0,-1)),1),C23)","v":"BLACK"},{"$f":"IF(AND(COUNTIF($D$7:D23,\"RED\")>0,COUNTIF($D$7:D23,\"BLACK\")>0),A23-MIN(_xlfn.XLOOKUP(\"BLACK\",$D$7:D23,$A$7:A23,\"\",0,-1),_xlfn.XLOOKUP(\"RED\",$D$7:D23,$A$7:A23,\"\",0,-1)),A23-6)","v":1},"BET","BLACK","SUCCESS",5,10,320,"",50,1,null,16,{"$f":"COUNTIF(E:E,P23)","v":0},0]
[{"$f":"ROW()","v":24},13,{"$f":"_xlfn.XLOOKUP(B24,AUX!$A:$A,AUX!$B:$B,\"\",0,1)","v":"RED"},{"$f":"IF(C24=0,INDEX($C:$C,MAX(_xlfn.XLOOKUP(\"BLACK\",$C$7:C24,$A$7:A24,\"\",0,-1),_xlfn.XLOOKUP(\"RED\",$C$7:C24,$A$7:A24,\"\",0,-1)),1),C24)","v":"RED"},{"$f":"IF(AND(COUNTIF($D$7:D24,\"RED\")>0,COUNTIF($D$7:D24,\"BLACK\")>0),A24-MIN(_xlfn.XLOOKUP(\"BLACK\",$D$7:D24,$A$7:A24,\"\",0,-1),_xlfn.XLOOKUP(\"RED\",$D$7:D24,$A$7:A24,\"\",0,-1)),A24-6)","v":1},"BET","RED","SUCCESS",5,10,325,"",50,1,null,17,{"$f":"COUNTIF(E:E,P24)","v":0},0]
[{"$f":"ROW()","v":25},16,{"$f":"_xlfn.XLOOKUP(B25,AUX!$A:$A,AUX!$B:$B,\"\",0,1)","v":"BLACK"},{"$f":"IF(C25=0,INDEX($C:$C,MAX(_xlfn.XLOOKUP(\"BLACK\",$C$7:C25,$A$7:A25,\"\",0,-1),_xlfn.XLOOKUP(\"RED\",$C$7:C25,$A$7:A25,\"\",0,-1)),1),C25)","v":"BLACK"},{"$f":"IF(AND(COUNTIF($D$7:D25,\"RED\")>0,COUNTIF($D$7:D25,\"BLACK\")>0),A25-MIN(_xlfn.XLOOKUP(\"BLACK\",$D$7:D25,$A$7:A25,\"\",0,-1),_xlfn.XLOOKUP(\"RED\",$D$7:D25,$A$7:A25,\"\",0,-1)),A25-6)","v":1},"BET","BLACK","SUCCESS",5,10,330,"",50,"",null,18,{"$f":"COUNTIF(E:E,P25)","v":0},0]
[{"$f":"ROW()","v":26},22,{"$f":"_xlfn.XLOOKUP(B26,AUX!$A:$A,AUX!$B:$B,\"\",0,1)","v":"BLACK"},{"$f":"IF(C26=0,INDEX($C:$C,MAX(_xlfn.XLOOKUP(\"BLACK\",$C$7:C26,$A$7:A26,\"\",0,-1),_xlfn.XLOOKUP(\"RED\",$C$7:C26,$A$7:A26,\"\",0,-1)),1),C26)","v":"BLACK"},{"$f":"IF(AND(COUNTIF($D$7:D26,\"RED\")>0,COUNTIF($D$7:D26,\"BLACK\")>0),A26-MIN(_xlfn.XLOOKUP(\"BLACK\",$D$7:D26,$A$7:A26,\"\",0,-1),_xlfn.XLOOKUP(\"RED\",$D$7:D26,$A$7:A26,\"\",0,-1)),A26-6)","v":2},"BET","RED","FAIL",5,0,325,"STOP",100,2,null,19,{"$f":"COUNTIF(E:E,P26)","v":0},0]
[{"$f":"ROW()","v":27},21,{"$f":"_xlfn.XLOOKUP(B27,AUX!$A:$A,AUX!$B:$B,\"\",0,1)","v":"RED"},{"$f":"IF(C27=0,INDEX($C:$C,MAX(_xlfn.XLOOKUP(\"BLACK\",$C$7:C27,$A$7:A27,\"\",0,-1),_xlfn.XLOOKUP(\"RED\",$C$7:C27,$A$7:A27,\"\",0,-1)),1),C27)","v":"RED"},{"$f":"IF(AND(COUNTIF($D$7:D27,\"RED\")>0,COUNTIF($D$7:D27,\"BLACK\")>0),A27-MIN(_xlfn.XLOOKUP(\"BLACK\",$D$7:D27,$A$7:A27,\"\",0,-1),_xlfn.XLOOKUP(\"RED\",$D$7:D27,$A$7:A27,\"\",0,-1)),A27-6)","v":1},"","","","","",325,"",50,"",null,20,{"$f":"COUNTIF(E:E,P27)","v":0},0]
[{"$f":"ROW()","v":28},23,{"$f":"_xlfn.XLOOKUP(B28,AUX!$A:$A,AUX!$B:$B,\"\",0,1)","v":"RED"},{"$f":"IF(C28=0,INDEX($C:$C,MAX(_xlfn.XLOOKUP(\"BLACK\",$C$7:C28,$A$7:A28,\"\",0,-1),_xlfn.XLOOKUP(\"RED\",$C$7:C28,$A$7:A28,\"\",0,-1)),1),C28)","v":"RED"},{"$f":"IF(AND(COUNTIF($D$7:D28,\"RED\")>0,COUNTIF($D$7:D28,\"BLACK\")>0),A28-MIN(_xlfn.XLOOKUP(\"BLACK\",$D$7:D28,$A$7:A28,\"\",0,-1),_xlfn.XLOOKUP(\"RED\",$D$7:D28,$A$7:A28,\"\",0,-1)),A28-6)","v":2},"BET","BLACK","FAIL",5,0,320,"STOP",100,""]
[{"$f":"ROW()","v":29},5,{"$f":"_xlfn.XLOOKUP(B29,AUX!$A:$A,AUX!$B:$B,\"\",0,1)","v":"RED"},{"$f":"IF(C29=0,INDEX($C:$C,MAX(_xlfn.XLOOKUP(\"BLACK\",$C$7:C29,$A$7:A29,\"\",0,-1),_xlfn.XLOOKUP(\"RED\",$C$7:C29,$A$7:A29,\"\",0,-1)),1),C29)","v":"RED"},{"$f":"IF(AND(COUNTIF($D$7:D29,\"RED\")>0,COUNTIF($D$7:D29,\"BLACK\")>0),A29-MIN(_xlfn.XLOOKUP(\"BLACK\",$D$7:D29,$A$7:A29,\"\",0,-1),_xlfn.XLOOKUP(\"RED\",$D$7:D29,$A$7:A29,\"\",0,-1)),A29-6)","v":3},"","","","","",320,"STOP",150,3]
[{"$f":"ROW()","v":30},34,{"$f":"_xlfn.XLOOKUP(B30,AUX!$A:$A,AUX!$B:$B,\"\",0,1)","v":"BLACK"},{"$f":"IF(C30=0,INDEX($C:$C,MAX(_xlfn.XLOOKUP(\"BLACK\",$C$7:C30,$A$7:A30,\"\",0,-1),_xlfn.XLOOKUP(\"RED\",$C$7:C30,$A$7:A30,\"\",0,-1)),1),C30)","v":"BLACK"},{"$f":"IF(AND(COUNTIF($D$7:D30,\"RED\")>0,COUNTIF($D$7:D30,\"BLACK\")>0),A30-MIN(_xlfn.XLOOKUP(\"BLACK\",$D$7:D30,$A$7:A30,\"\",0,-1),_xlfn.XLOOKUP(\"RED\",$D$7:D30,$A$7:A30,\"\",0,-1)),A30-6)","v":1},"","","","","",320,"",50,1]
[{"$f":"ROW()","v":31},3,{"$f":"_xlfn.XLOOKUP(B31,AUX!$A:$A,AUX!$B:$B,\"\",0,1)","v":"RED"},{"$f":"IF(C31=0,INDEX($C:$C,MAX(_xlfn.XLOOKUP(\"BLACK\",$C$7:C31,$A$7:A31,\"\",0,-1),_xlfn.XLOOKUP(\"RED\",$C$7:C31,$A$7:A31,\"\",0,-1)),1),C31)","v":"RED"},{"$f":"IF(AND(COUNTIF($D$7:D31,\"RED\")>0,COUNTIF($D$7:D31,\"BLACK\")>0),A31-MIN(_xlfn.XLOOKUP(\"BLACK\",$D$7:D31,$A$7:A31,\"\",0,-1),_xlfn.XLOOKUP(\"RED\",$D$7:D31,$A$7:A31,\"\",0,-1)),A31-6)","v":1},"BET","RED","SUCCESS",5,10,325,"",50,""]
[{"$f":"ROW()","v":32},17,{"$f":"_xlfn.XLOOKUP(B32,AUX!$A:$A,AUX!$B:$B,\"\",0,1)","v":"RED"},{"$f":"IF(C32=0,INDEX($C:$C,MAX(_xlfn.XLOOKUP(\"BLACK\",$C$7:C32,$A$7:A32,\"\",0,-1),_xlfn.XLOOKUP(\"RED\",$C$7:C32,$A$7:A32,\"\",0,-1)),1),C32)","v":"RED"},{"$f":"IF(AND(COUNTIF($D$7:D32,\"RED\")>0,COUNTIF($D$7:D32,\"BLACK\")>0),A32-MIN(_xlfn.XLOOKUP(\"BLACK\",$D$7:D32,$A$7:A32,\"\",0,-1),_xlfn.XLOOKUP(\"RED\",$D$7:D32,$A$7:A32,\"\",0,-1)),A32-6)","v":2},"BET","BLACK","FAIL",5,0,320,"STOP",100,""]
[{"$f":"ROW()","v":33},17,{"$f":"_xlfn.XLOOKUP(B33,AUX!$A:$A,AUX!$B:$B,\"\",0,1)","v":"RED"},{"$f":"IF(C33=0,INDEX($C:$C,MAX(_xlfn.XLOOKUP(\"BLACK\",$C$7:C33,$A$7:A33,\"\",0,-1),_xlfn.XLOOKUP(\"RED\",$C$7:C33,$A$7:A33,\"\",0,-1)),1),C33)","v":"RED"},{"$f":"IF(AND(COUNTIF($D$7:D33,\"RED\")>0,COUNTIF($D$7:D33,\"BLACK\")>0),A33-MIN(_xlfn.XLOOKUP(\"BLACK\",$D$7:D33,$A$7:A33,\"\",0,-1),_xlfn.XLOOKUP(\"RED\",$D$7:D33,$A$7:A33,\"\",0,-1)),A33-6)","v":3},"","","","","",320,"STOP",150,""]
[{"$f":"ROW()","v":34},13,{"$f":"_xlfn.XLOOKUP(B34,AUX!$A:$A,AUX!$B:$B,\"\",0,1)","v":"RED"},{"$f":"IF(C34=0,INDEX($C:$C,MAX(_xlfn.XLOOKUP(\"BLACK\",$C$7:C34,$A$7:A34,\"\",0,-1),_xlfn.XLOOKUP(\"RED\",$C$7:C34,$A$7:A34,\"\",0,-1)),1),C34)","v":"RED"},{"$f":"IF(AND(COUNTIF($D$7:D34,\"RED\")>0,COUNTIF($D$7:D34,\"BLACK\")>0),A34-MIN(_xlfn.XLOOKUP(\"BLACK\",$D$7:D34,$A$7:A34,\"\",0,-1),_xlfn.XLOOKUP(\"RED\",$D$7:D34,$A$7:A34,\"\",0,-1)),A34-6)","v":4},"","","","","",320,"STOP",200,4]
[{"$f":"ROW()","v":35},32,{"$f":"_xlfn.XLOOKUP(B35,AUX!$A:$A,AUX!$B:$B,\"\",0,1)","v":"BLACK"},{"$f":"IF(C35=0,INDEX($C:$C,MAX(_xlfn.XLOOKUP(\"BLACK\",$C$7:C35,$A$7:A35,\"\",0,-1),_xlfn.XLOOKUP(\"RED\",$C$7:C35,$A$7:A35,\"\",0,-1)),1),C35)","v":"BLACK"},{"$f":"IF(AND(COUNTIF($D$7:D35,\"RED\")>0,COUNTIF($D$7:D35,\"BLACK\")>0),A35-MIN(_xlfn.XLOOKUP(\"BLACK\",$D$7:D35,$A$7:A35,\"\",0,-1),_xlfn.XLOOKUP(\"RED\",$D$7:D35,$A$7:A35,\"\",0,-1)),A35-6)","v":1},"","","","","",320,"",50,""]
[{"$f":"ROW()","v":36},4,{"$f":"_xlfn.XLOOKUP(B36,AUX!$A:$A,AUX!$B:$B,\"\",0,1)","v":"BLACK"},{"$f":"IF(C36=0,INDEX($C:$C,MAX(_xlfn.XLOOKUP(\"BLACK\",$C$7:C36,$A$7:A36,\"\",0,-1),_xlfn.XLOOKUP(\"RED\",$C$7:C36,$A$7:A36,\"\",0,-1)),1),C36)","v":"BLACK"},{"$f":"IF(AND(COUNTIF($D$7:D36,\"RED\")>0,COUNTIF($D$7:D36,\"BLACK\")>0),A36-MIN(_xlfn.XLOOKUP(\"BLACK\",$D$7:D36,$A$7:A36,\"\",0,-1),_xlfn.XLOOKUP(\"RED\",$D$7:D36,$A$7:A36,\"\",0,-1)),A36-6)","v":2},"BET","RED","FAIL",5,0,315,"STOP",100,""]
[{"$f":"ROW()","v":37},26,{"$f":"_xlfn.XLOOKUP(B37,AUX!$A:$A,AUX!$B:$B,\"\",0,1)","v":"BLACK"},{"$f":"IF(C37=0,INDEX($C:$C,MAX(_xlfn.XLOOKUP(\"BLACK\",$C$7:C37,$A$7:A37,\"\",0,-1),_xlfn.XLOOKUP(\"RED\",$C$7:C37,$A$7:A37,\"\",0,-1)),1),C37)","v":"BLACK"},{"$f":"IF(AND(COUNTIF($D$7:D37,\"RED\")>0,COUNTIF($D$7:D37,\"BLACK\")>0),A37-MIN(_xlfn.XLOOKUP(\"BLACK\",$D$7:D37,$A$7:A37,\"\",0,-1),_xlfn.XLOOKUP(\"RED\",$D$7:D37,$A$7:A37,\"\",0,-1)),A37-6)","v":3},"","","","","",315,"STOP",150,3]
[{"$f":"ROW()","v":38},35,{"$f":"_xlfn.XLOOKUP(B38,AUX!$A:$A,AUX!$B:$B,\"\",0,1)","v":"RED"},{"$f":"IF(C38=0,INDEX($C:$C,MAX(_xlfn.XLOOKUP(\"BLACK\",$C$7:C38,$A$7:A38,\"\",0,-1),_xlfn.XLOOKUP(\"RED\",$C$7:C38,$A$7:A38,\"\",0,-1)),1),C38)","v":"RED"},{"$f":"IF(AND(COUNTIF($D$7:D38,\"RED\")>0,COUNTIF($D$7:D38,\"BLACK\")>0),A38-MIN(_xlfn.XLOOKUP(\"BLACK\",$D$7:D38,$A$7:A38,\"\",0,-1),_xlfn.XLOOKUP(\"RED\",$D$7:D38,$A$7:A38,\"\",0,-1)),A38-6)","v":1},"","","","","",315,"",50,1]
[{"$f":"ROW()","v":39},12,{"$f":"_xlfn.XLOOKUP(B39,AUX!$A:$A,AUX!$B:$B,\"\",0,1)","v":"BLACK"},{"$f":"IF(C39=0,INDEX($C:$C,MAX(_xlfn.XLOOKUP(\"BLACK\",$C$7:C39,$A$7:A39,\"\",0,-1),_xlfn.XLOOKUP(\"RED\",$C$7:C39,$A$7:A39,\"\",0,-1)),1),C39)","v":"BLACK"},{"$f":"IF(AND(COUNTIF($D$7:D39,\"RED\")>0,COUNTIF($D$7:D39,\"BLACK\")>0),A39-MIN(_xlfn.XLOOKUP(\"BLACK\",$D$7:D39,$A$7:A39,\"\",0,-1),_xlfn.XLOOKUP(\"RED\",$D$7:D39,$A$7:A39,\"\",0,-1)),A39-6)","v":1},"BET","BLACK","SUCCESS",5,10,320,"",50,""]
[{"$f":"ROW()","v":40},20,{"$f":"_xlfn.XLOOKUP(B40,AUX!$A:$A,AUX!$B:$B,\"\",0,1)","v":"BLACK"},{"$f":"IF(C40=0,INDEX($C:$C,MAX(_xlfn.XLOOKUP(\"BLACK\",$C$7:C40,$A$7:A40,\"\",0,-1),_xlfn.XLOOKUP(\"RED\",$C$7:C40,$A$7:A40,\"\",0,-1)),1),C40)","v":"BLACK"},{"$f":"IF(AND(COUNTIF($D$7:D40,\"RED\")>0,COUNTIF($D$7:D40,\"BLACK\")>0),A40-MIN(_xlfn.XLOOKUP(\"BLACK\",$D$7:D40,$A$7:A40,\"\",0,-1),_xlfn.XLOOKUP(\"RED\",$D$7:D40,$A$7:A40,\"\",0,-1)),A40-6)","v":2},"BET","RED","FAIL",5,0,315,"STOP",100,""]
[{"$f":"ROW()","v":41},34,{"$f":"_xlfn.XLOOKUP(B41,AUX!$A:$A,AUX!$B:$B,\"\",0,1)","v":"BLACK"},{"$f":"IF(C41=0,INDEX($C:$C,MAX(_xlfn.XLOOKUP(\"BLACK\",$C$7:C41,$A$7:A41,\"\",0,-1),_xlfn.XLOOKUP(\"RED\",$C$7:C41,$A$7:A41,\"\",0,-1)),1),C41)","v":"BLACK"},{"$f":"IF(AND(COUNTIF($D$7:D41,\"RED\")>0,COUNTIF($D$7:D41,\"BLACK\")>0),A41-MIN(_xlfn.XLOOKUP(\"BLACK\",$D$7:D41,$A$7:A41,\"\",0,-1),_xlfn.XLOOKUP(\"RED\",$D$7:D41,$A$7:A41,\"\",0,-1)),A41-6)","v":3},"","","","","",315,"STOP",150,""]
[{"$f":"ROW()","v":42},4,{"$f":"_xlfn.XLOOKUP(B42,AUX!$A:$A,AUX!$B:$B,\"\",0,1)","v":"BLACK"},{"$f":"IF(C42=0,INDEX($C:$C,MAX(_xlfn.XLOOKUP(\"BLACK\",$C$7:C42,$A$7:A42,\"\",0,-1),_xlfn.XLOOKUP(\"RED\",$C$7:C42,$A$7:A42,\"\",0,-1)),1),C42)","v":"BLACK"},{"$f":"IF(AND(COUNTIF($D$7:D42,\"RED\")>0,COUNTIF($D$7:D42,\"BLACK\")>0),A42-MIN(_xlfn.XLOOKUP(\"BLACK\",$D$7:D42,$A$7:A42,\"\",0,-1),_xlfn.XLOOKUP(\"RED\",$D$7:D42,$A$7:A42,\"\",0,-1)),A42-6)","v":4},"","","","","",315,"STOP",200,""]
[{"$f":"ROW()","v":43},24,{"$f":"_xlfn.XLOOKUP(B43,AUX!$A:$A,AUX!$B:$B,\"\",0,1)","v":"BLACK"},{"$f":"IF(C43=0,INDEX($C:$C,MAX(_xlfn.XLOOKUP(\"BLACK\",$C$7:C43,$A$7:A43,\"\",0,-1),_xlfn.XLOOKUP(\"RED\",$C$7:C43,$A$7:A43,\"\",0,-1)),1),C43)","v":"BLACK"},{"$f":"IF(AND(COUNTIF($D$7:D43,\"RED\")>0,COUNTIF($D$7:D43,\"BLACK\")>0),A43-MIN(_xlfn.XLOOKUP(\"BLACK\",$D$7:D43,$A$7:A43,\"\",0,-1),_xlfn.XLOOKUP(\"RED\",$D$7:D43,$A$7:A43,\"\",0,-1)),A43-6)","v":5},"","","","","",315,"STOP",250,5]
[{"$f":"ROW()","v":44},3,{"$f":"_xlfn.XLOOKUP(B44,AUX!$A:$A,AUX!$B:$B,\"\",0,1)","v":"RED"},{"$f":"IF(C44=0,INDEX($C:$C,MAX(_xlfn.XLOOKUP(\"BLACK\",$C$7:C44,$A$7:A44,\"\",0,-1),_xlfn.XLOOKUP(\"RED\",$C$7:C44,$A$7:A44,\"\",0,-1)),1),C44)","v":"RED"},{"$f":"IF(AND(COUNTIF($D$7:D44,\"RED\")>0,COUNTIF($D$7:D44,\"BLACK\")>0),A44-MIN(_xlfn.XLOOKUP(\"BLACK\",$D$7:D44,$A$7:A44,\"\",0,-1),_xlfn.XLOOKUP(\"RED\",$D$7:D44,$A$7:A44,\"\",0,-1)),A44-6)","v":1},"","","","","",315,"",50,""]
[{"$f":"ROW()","v":45},21,{"$f":"_xlfn.XLOOKUP(B45,AUX!$A:$A,AUX!$B:$B,\"\",0,1)","v":"RED"},{"$f":"IF(C45=0,INDEX($C:$C,MAX(_xlfn.XLOOKUP(\"BLACK\",$C$7:C45,$A$7:A45,\"\",0,-1),_xlfn.XLOOKUP(\"RED\",$C$7:C45,$A$7:A45,\"\",0,-1)),1),C45)","v":"RED"},{"$f":"IF(AND(COUNTIF($D$7:D45,\"RED\")>0,COUNTIF($D$7:D45,\"BLACK\")>0),A45-MIN(_xlfn.XLOOKUP(\"BLACK\",$D$7:D45,$A$7:A45,\"\",0,-1),_xlfn.XLOOKUP(\"RED\",$D$7:D45,$A$7:A45,\"\",0,-1)),A45-6)","v":2},"BET","BLACK","FAIL",5,0,310,"STOP",100,""]
[{"$f":"ROW()","v":46},9,{"$f":"_xlfn.XLOOKUP(B46,AUX!$A:$A,AUX!$B:$B,\"\",0,1)","v":"RED"},{"$f":"IF(C46=0,INDEX($C:$C,MAX(_xlfn.XLOOKUP(\"BLACK\",$C$7:C46,$A$7:A46,\"\",0,-1),_xlfn.XLOOKUP(\"RED\",$C$7:C46,$A$7:A46,\"\",0,-1)),1),C46)","v":"RED"},{"$f":"IF(AND(COUNTIF($D$7:D46,\"RED\")>0,COUNTIF($D$7:D46,\"BLACK\")>0),A46-MIN(_xlfn.XLOOKUP(\"BLACK\",$D$7:D46,$A$7:A46,\"\",0,-1),_xlfn.XLOOKUP(\"RED\",$D$7:D46,$A$7:A46,\"\",0,-1)),A46-6)","v":3},"","","","","",310,"STOP",150,3]
[{"$f":"ROW()","v":47},30,{"$f":"_xlfn.XLOOKUP(B47,AUX!$A:$A,AUX!$B:$B,\"\",0,1)","v":"BLACK"},{"$f":"IF(C47=0,INDEX($C:$C,MAX(_xlfn.XLOOKUP(\"BLACK\",$C$7:C47,$A$7:A47,\"\",0,-1),_xlfn.XLOOKUP(\"RED\",$C$7:C47,$A$7:A47,\"\",0,-1)),1),C47)","v":"BLACK"},{"$f":"IF(AND(COUNTIF($D$7:D47,\"RED\")>0,COUNTIF($D$7:D47,\"BLACK\")>0),A47-MIN(_xlfn.XLOOKUP(\"BLACK\",$D$7:D47,$A$7:A47,\"\",0,-1),_xlfn.XLOOKUP(\"RED\",$D$7:D47,$A$7:A47,\"\",0,-1)),A47-6)","v":1},"","","","","",310,"",50,1]
[{"$f":"ROW()","v":48},23,{"$f":"_xlfn.XLOOKUP(B48,AUX!$A:$A,AUX!$B:$B,\"\",0,1)","v":"RED"},{"$f":"IF(C48=0,INDEX($C:$C,MAX(_xlfn.XLOOKUP(\"BLACK\",$C$7:C48,$A$7:A48,\"\",0,-1),_xlfn.XLOOKUP(\"RED\",$C$7:C48,$A$7:A48,\"\",0,-1)),1),C48)","v":"RED"},{"$f":"IF(AND(COUNTIF($D$7:D48,\"RED\")>0,COUNTIF($D$7:D48,\"BLACK\")>0),A48-MIN(_xlfn.XLOOKUP(\"BLACK\",$D$7:D48,$A$7:A48,\"\",0,-1),_xlfn.XLOOKUP(\"RED\",$D$7:D48,$A$7:A48,\"\",0,-1)),A48-6)","v":1},"BET","RED","SUCCESS",5,10,315,"",50,1]
[{"$f":"ROW()","v":49},14,{"$f":"_xlfn.XLOOKUP(B49,AUX!$A:$A,AUX!$B:$B,\"\",0,1)","v":"BLACK"},{"$f":"IF(C49=0,INDEX($C:$C,MAX(_xlfn.XLOOKUP(\"BLACK\",$C$7:C49,$A$7:A49,\"\",0,-1),_xlfn.XLOOKUP(\"RED\",$C$7:C49,$A$7:A49,\"\",0,-1)),1),C49)","v":"BLACK"},{"$f":"IF(AND(COUNTIF($D$7:D49,\"RED\")>0,COUNTIF($D$7:D49,\"BLACK\")>0),A49-MIN(_xlfn.XLOOKUP(\"BLACK\",$D$7:D49,$A$7:A49,\"\",0,-1),_xlfn.XLOOKUP(\"RED\",$D$7:D49,$A$7:A49,\"\",0,-1)),A49-6)","v":1},"BET","BLACK","SUCCESS",5,10,320,"",50,""]
[{"$f":"ROW()","v":50},14,{"$f":"_xlfn.XLOOKUP(B50,AUX!$A:$A,AUX!$B:$B,\"\",0,1)","v":"BLACK"},{"$f":"IF(C50=0,INDEX($C:$C,MAX(_xlfn.XLOOKUP(\"BLACK\",$C$7:C50,$A$7:A50,\"\",0,-1),_xlfn.XLOOKUP(\"RED\",$C$7:C50,$A$7:A50,\"\",0,-1)),1),C50)","v":"BLACK"},{"$f":"IF(AND(COUNTIF($D$7:D50,\"RED\")>0,COUNTIF($D$7:D50,\"BLACK\")>0),A50-MIN(_xlfn.XLOOKUP(\"BLACK\",$D$7:D50,$A$7:A50,\"\",0,-1),_xlfn.XLOOKUP(\"RED\",$D$7:D50,$A$7:A50,\"\",0,-1)),A50-6)","v":2},"BET","RED","FAIL",5,0,315,"STOP",100,2]
[{"$f":"ROW()","v":51},9,{"$f":"_xlfn.XLOOKUP(B51,AUX!$A:$A,AUX!$B:$B,\"\",0,1)","v":"RED"},{"$f":"IF(C51=0,INDEX($C:$C,MAX(_xlfn.XLOOKUP(\"BLACK\",$C$7:C51,$A$7:A51,\"\",0,-1),_xlfn.XLOOKUP(\"RED\",$C$7:C51,$A$7:A51,\"\",0,-1)),1),C51)","v":"RED"},{"$f":"IF(AND(COUNTIF($D$7:D51,\"RED\")>0,COUNTIF($D$7:D51,\"BLACK\")>0),A51-MIN(_xlfn.XLOOKUP(\"BLACK\",$D$7:D51,$A$7:A51,\"\",0,-1),_xlfn.XLOOKUP(\"RED\",$D$7:D51,$A$7:A51,\"\",0,-1)),A51-6)","v":1},"","","","","",315,"",50,1]
[{"$f":"ROW()","v":52},24,{"$f":"_xlfn.XLOOKUP(B52,AUX!$A:$A,AUX!$B:$B,\"\",0,1)","v":"BLACK"},{"$f":"IF(C52=0,INDEX($C:$C,MAX(_xlfn.XLOOKUP(\"BLACK\",$C$7:C52,$A$7:A52,\"\",0,-1),_xlfn.XLOOKUP(\"RED\",$C$7:C52,$A$7:A52,\"\",0,-1)),1),C52)","v":"BLACK"},{"$f":"IF(AND(COUNTIF($D$7:D52,\"RED\")>0,COUNTIF($D$7:D52,\"BLACK\")>0),A52-MIN(_xlfn.XLOOKUP(\"BLACK\",$D$7:D52,$A$7:A52,\"\",0,-1),_xlfn.XLOOKUP(\"RED\",$D$7:D52,$A$7:A52,\"\",0,-1)),A52-6)","v":1},"BET","BLACK","SUCCESS",5,10,320,"",50,1]
[{"$f":"ROW()","v":53},9,{"$f":"_xlfn.XLOOKUP(B53,AUX!$A:$A,AUX!$B:$B,\"\",0,1)","v":"RED"},{"$f":"IF(C53=0,INDEX($C:$C,MAX(_xlfn.XLOOKUP(\"BLACK\",$C$7:C53,$A$7:A53,\"\",0,-1),_xlfn.XLOOKUP(\"RED\",$C$7:C53,$A$7:A53,\"\",0,-1)),1),C53)","v":"RED"},{"$f":"IF(AND(COUNTIF($D$7:D53,\"RED\")>0,COUNTIF($D$7:D53,\"BLACK\")>0),A53-MIN(_xlfn.XLOOKUP(\"BLACK\",$D$7:D53,$A$7:A53,\"\",0,-1),_xlfn.XLOOKUP(\"RED\",$D$7:D53,$A$7:A53,\"\",0,-1)),A53-6)","v":1},"BET","RED","SUCCESS",5,10,325,"",50,""]
[{"$f":"ROW()","v":54},33,{"$f":"_xlfn.XLOOKUP(B54,AUX!$A:$A,AUX!$B:$B,\"\",0,1)","v":"RED"},{"$f":"IF(C54=0,INDEX($C:$C,MAX(_xlfn.XLOOKUP(\"BLACK\",$C$7:C54,$A$7:A54,\"\",0,-1),_xlfn.XLOOKUP(\"RED\",$C$7:C54,$A$7:A54,\"\",0,-1)),1),C54)","v":"RED"},{"$f":"IF(AND(COUNTIF($D$7:D54,\"RED\")>0,COUNTIF($D$7:D54,\"BLACK\")>0),A54-MIN(_xlfn.XLOOKUP(\"BLACK\",$D$7:D54,$A$7:A54,\"\",0,-1),_xlfn.XLOOKUP(\"RED\",$D$7:D54,$A$7:A54,\"\",0,-1)),A54-6)","v":2},"BET","BLACK","FAIL",5,0,320,"STOP",100,2]
[{"$f":"ROW()","v":55},18,{"$f":"_xlfn.XLOOKUP(B55,AUX!$A:$A,AUX!$B:$B,\"\",0,1)","v":"BLACK"},{"$f":"IF(C55=0,INDEX($C:$C,MAX(_xlfn.XLOOKUP(\"BLACK\",$C$7:C55,$A$7:A55,\"\",0,-1),_xlfn.XLOOKUP(\"RED\",$C$7:C55,$A$7:A55,\"\",0,-1)),1),C55)","v":"BLACK"},{"$f":"IF(AND(COUNTIF($D$7:D55,\"RED\")>0,COUNTIF($D$7:D55,\"BLACK\")>0),A55-MIN(_xlfn.XLOOKUP(\"BLACK\",$D$7:D55,$A$7:A55,\"\",0,-1),_xlfn.XLOOKUP(\"RED\",$D$7:D55,$A$7:A55,\"\",0,-1)),A55-6)","v":1},"","","","","",320,"",50,""]
[{"$f":"ROW()","v":56},2,{"$f":"_xlfn.XLOOKUP(B56,AUX!$A:$A,AUX!$B:$B,\"\",0,1)","v":"BLACK"},{"$f":"IF(C56=0,INDEX($C:$C,MAX(_xlfn.XLOOKUP(\"BLACK\",$C$7:C56,$A$7:A56,\"\",0,-1),_xlfn.XLOOKUP(\"RED\",$C$7:C56,$A$7:A56,\"\",0,-1)),1),C56)","v":"BLACK"},{"$f":"IF(AND(COUNTIF($D$7:D56,\"RED\")>0,COUNTIF($D$7:D56,\"BLACK\")>0),A56-MIN(_xlfn.XLOOKUP(\"BLACK\",$D$7:D56,$A$7:A56,\"\",0,-1),_xlfn.XLOOKUP(\"RED\",$D$7:D56,$A$7:A56,\"\",0,-1)),A56-6)","v":2},"BET","RED","FAIL",5,0,315,"STOP",100,2]
[{"$f":"ROW()","v":57},3,{"$f":"_xlfn.XLOOKUP(B57,AUX!$A:$A,AUX!$B:$B,\"\",0,1)","v":"RED"},{"$f":"IF(C57=0,INDEX($C:$C,MAX(_xlfn.XLOOKUP(\"BLACK\",$C$7:C57,$A$7:A57,\"\",0,-1),_xlfn.XLOOKUP(\"RED\",$C$7:C57,$A$7:A57,\"\",0,-1)),1),C57)","v":"RED"},{"$f":"IF(AND(COUNTIF($D$7:D57,\"RED\")>0,COUNTIF($D$7:D57,\"BLACK\")>0),A57-MIN(_xlfn.XLOOKUP(\"BLACK\",$D$7:D57,$A$7:A57,\"\",0,-1),_xlfn.XLOOKUP(\"RED\",$D$7:D57,$A$7:A57,\"\",0,-1)),A57-6)","v":1},"","","","","",315,"",50,1]
[{"$f":"ROW()","v":58},34,{"$f":"_xlfn.XLOOKUP(B58,AUX!$A:$A,AUX!$B:$B,\"\",0,1)","v":"BLACK"},{"$f":"IF(C58=0,INDEX($C:$C,MAX(_xlfn.XLOOKUP(\"BLACK\",$C$7:C58,$A$7:A58,\"\",0,-1),_xlfn.XLOOKUP(\"RED\",$C$7:C58,$A$7:A58,\"\",0,-1)),1),C58)","v":"BLACK"},{"$f":"IF(AND(COUNTIF($D$7:D58,\"RED\")>0,COUNTIF($D$7:D58,\"BLACK\")>0),A58-MIN(_xlfn.XLOOKUP(\"BLACK\",$D$7:D58,$A$7:A58,\"\",0,-1),_xlfn.XLOOKUP(\"RED\",$D$7:D58,$A$7:A58,\"\",0,-1)),A58-6)","v":1},"BET","BLACK","SUCCESS",5,10,320,"",50,""]
[{"$f":"ROW()","v":59},30,{"$f":"_xlfn.XLOOKUP(B59,AUX!$A:$A,AUX!$B:$B,\"\",0,1)","v":"BLACK"},{"$f":"IF(C59=0,INDEX($C:$C,MAX(_xlfn.XLOOKUP(\"BLACK\",$C$7:C59,$A$7:A59,\"\",0,-1),_xlfn.XLOOKUP(\"RED\",$C$7:C59,$A$7:A59,\"\",0,-1)),1),C59)","v":"BLACK"},{"$f":"IF(AND(COUNTIF($D$7:D59,\"RED\")>0,COUNTIF($D$7:D59,\"BLACK\")>0),A59-MIN(_xlfn.XLOOKUP(\"BLACK\",$D$7:D59,$A$7:A59,\"\",0,-1),_xlfn.XLOOKUP(\"RED\",$D$7:D59,$A$7:A59,\"\",0,-1)),A59-6)","v":2},"BET","RED","FAIL",5,0,315,"STOP",100,2]
[{"$f":"ROW()","v":60},9,{"$f":"_xlfn.XLOOKUP(B60,AUX!$A:$A,AUX!$B:$B,\"\",0,1)","v":"RED"},{"$f":"IF(C60=0,INDEX($C:$C,MAX(_xlfn.XLOOKUP(\"BLACK\",$C$7:C60,$A$7:A60,\"\",0,-1),_xlfn.XLOOKUP(\"RED\",$C$7:C60,$A$7:A60,\"\",0,-1)),1),C60)","v":"RED"},{"$f":"IF(AND(COUNTIF($D$7:D60,\"RED\")>0,COUNTIF($D$7:D60,\"BLACK\")>0),A60-MIN(_xlfn.XLOOKUP(\"BLACK\",$D$7:D60,$A$7:A60,\"\",0,-1),_xlfn.XLOOKUP(\"RED\",$D$7:D60,$A$7:A60,\"\",0,-1)),A60-6)","v":1},"","","","","",315,"",50,""]
[{"$f":"ROW()","v":61},9,{"$f":"_xlfn.XLOOKUP(B61,AUX!$A:$A,AUX!$B:$B,\"\",0,1)","v":"RED"},{"$f":"IF(C61=0,INDEX($C:$C,MAX(_xlfn.XLOOKUP(\"BLACK\",$C$7:C61,$A$7:A61,\"\",0,-1),_xlfn.XLOOKUP(\"RED\",$C$7:C61,$A$7:A61,\"\",0,-1)),1),C61)","v":"RED"},{"$f":"IF(AND(COUNTIF($D$7:D61,\"RED\")>0,COUNTIF($D$7:D61,\"BLACK\")>0),A61-MIN(_xlfn.XLOOKUP(\"BLACK\",$D$7:D61,$A$7:A61,\"\",0,-1),_xlfn.XLOOKUP(\"RED\",$D$7:D61,$A$7:A61,\"\",0,-1)),A61-6)","v":2},"BET","BLACK","FAIL",5,0,310,"STOP",100,2]
[{"$f":"ROW()","v":62},34,{"$f":"_xlfn.XLOOKUP(B62,AUX!$A:$A,AUX!$B:$B,\"\",0,1)","v":"BLACK"},{"$f":"IF(C62=0,INDEX($C:$C,MAX(_xlfn.XLOOKUP(\"BLACK\",$C$7:C62,$A$7:A62,\"\",0,-1),_xlfn.XLOOKUP(\"RED\",$C$7:C62,$A$7:A62,\"\",0,-1)),1),C62)","v":"BLACK"},{"$f":"IF(AND(COUNTIF($D$7:D62,\"RED\")>0,COUNTIF($D$7:D62,\"BLACK\")>0),A62-MIN(_xlfn.XLOOKUP(\"BLACK\",$D$7:D62,$A$7:A62,\"\",0,-1),_xlfn.XLOOKUP(\"RED\",$D$7:D62,$A$7:A62,\"\",0,-1)),A62-6)","v":1},"","","","","",310,"",50,""]
[{"$f":"ROW()","v":63},10,{"$f":"_xlfn.XLOOKUP(B63,AUX!$A:$A,AUX!$B:$B,\"\",0,1)","v":"BLACK"},{"$f":"IF(C63=0,INDEX($C:$C,MAX(_xlfn.XLOOKUP(\"BLACK\",$C$7:C63,$A$7:A63,\"\",0,-1),_xlfn.XLOOKUP(\"RED\",$C$7:C63,$A$7:A63,\"\",0,-1)),1),C63)","v":"BLACK"},{"$f":"IF(AND(COUNTIF($D$7:D63,\"RED\")>0,COUNTIF($D$7:D63,\"BLACK\")>0),A63-MIN(_xlfn.XLOOKUP(\"BLACK\",$D$7:D63,$A$7:A63,\"\",0,-1),_xlfn.XLOOKUP(\"RED\",$D$7:D63,$A$7:A63,\"\",0,-1)),A63-6)","v":2},"BET","RED","FAIL",5,0,305,"STOP",100,2]
[{"$f":"ROW()","v":64},9,{"$f":"_xlfn.XLOOKUP(B64,AUX!$A:$A,AUX!$B:$B,\"\",0,1)","v":"RED"},{"$f":"IF(C64=0,INDEX($C:$C,MAX(_xlfn.XLOOKUP(\"BLACK\",$C$7:C64,$A$7:A64,\"\",0,-1),_xlfn.XLOOKUP(\"RED\",$C$7:C64,$A$7:A64,\"\",0,-1)),1),C64)","v":"RED"},{"$f":"IF(AND(COUNTIF($D$7:D64,\"RED\")>0,COUNTIF($D$7:D64,\"BLACK\")>0),A64-MIN(_xlfn.XLOOKUP(\"BLACK\",$D$7:D64,$A$7:A64,\"\",0,-1),_xlfn.XLOOKUP(\"RED\",$D$7:D64,$A$7:A64,\"\",0,-1)),A64-6)","v":1},"","","","","",305,"",50,""]
[{"$f":"ROW()","v":65},11,{"$f":"_xlfn.XLOOKUP(B65,AUX!$A:$A,AUX!$B:$B,\"\",0,1)","v":"RED"},{"$f":"IF(C65=0,INDEX($C:$C,MAX(_xlfn.XLOOKUP(\"BLACK\",$C$7:C65,$A$7:A65,\"\",0,-1),_xlfn.XLOOKUP(\"RED\",$C$7:C65,$A$7:A65,\"\",0,-1)),1),C65)","v":"RED"},{"$f":"IF(AND(COUNTIF($D$7:D65,\"RED\")>0,COUNTIF($D$7:D65,\"BLACK\")>0),A65-MIN(_xlfn.XLOOKUP(\"BLACK\",$D$7:D65,$A$7:A65,\"\",0,-1),_xlfn.XLOOKUP(\"RED\",$D$7:D65,$A$7:A65,\"\",0,-1)),A65-6)","v":2},"BET","BLACK","FAIL",5,0,300,"STOP",100,""]
[{"$f":"ROW()","v":66},25,{"$f":"_xlfn.XLOOKUP(B66,AUX!$A:$A,AUX!$B:$B,\"\",0,1)","v":"RED"},{"$f":"IF(C66=0,INDEX($C:$C,MAX(_xlfn.XLOOKUP(\"BLACK\",$C$7:C66,$A$7:A66,\"\",0,-1),_xlfn.XLOOKUP(\"RED\",$C$7:C66,$A$7:A66,\"\",0,-1)),1),C66)","v":"RED"},{"$f":"IF(AND(COUNTIF($D$7:D66,\"RED\")>0,COUNTIF($D$7:D66,\"BLACK\")>0),A66-MIN(_xlfn.XLOOKUP(\"BLACK\",$D$7:D66,$A$7:A66,\"\",0,-1),_xlfn.XLOOKUP(\"RED\",$D$7:D66,$A$7:A66,\"\",0,-1)),A66-6)","v":3},"","","","","",300,"STOP",150,3]
[{"$f":"ROW()","v":67},22,{"$f":"_xlfn.XLOOKUP(B67,AUX!$A:$A,AUX!$B:$B,\"\",0,1)","v":"BLACK"},{"$f":"IF(C67=0,INDEX($C:$C,MAX(_xlfn.XLOOKUP(\"BLACK\",$C$7:C67,$A$7:A67,\"\",0,-1),_xlfn.XLOOKUP(\"RED\",$C$7:C67,$A$7:A67,\"\",0,-1)),1),C67)","v":"BLACK"},{"$f":"IF(AND(COUNTIF($D$7:D67,\"RED\")>0,COUNTIF($D$7:D67,\"BLACK\")>0),A67-MIN(_xlfn.XLOOKUP(\"BLACK\",$D$7:D67,$A$7:A67,\"\",0,-1),_xlfn.XLOOKUP(\"RED\",$D$7:D67,$A$7:A67,\"\",0,-1)),A67-6)","v":1},"","","","","",300,"",50,""]
[{"$f":"ROW()","v":68},4,{"$f":"_xlfn.XLOOKUP(B68,AUX!$A:$A,AUX!$B:$B,\"\",0,1)","v":"BLACK"},{"$f":"IF(C68=0,INDEX($C:$C,MAX(_xlfn.XLOOKUP(\"BLACK\",$C$7:C68,$A$7:A68,\"\",0,-1),_xlfn.XLOOKUP(\"RED\",$C$7:C68,$A$7:A68,\"\",0,-1)),1),C68)","v":"BLACK"},{"$f":"IF(AND(COUNTIF($D$7:D68,\"RED\")>0,COUNTIF($D$7:D68,\"BLACK\")>0),A68-MIN(_xlfn.XLOOKUP(\"BLACK\",$D$7:D68,$A$7:A68,\"\",0,-1),_xlfn.XLOOKUP(\"RED\",$D$7:D68,$A$7:A68,\"\",0,-1)),A68-6)","v":2},"BET","RED","FAIL",5,0,295,"STOP",100,""]
[{"$f":"ROW()","v":69},14,{"$f":"_xlfn.XLOOKUP(B69,AUX!$A:$A,AUX!$B:$B,\"\",0,1)","v":"BLACK"},{"$f":"IF(C69=0,INDEX($C:$C,MAX(_xlfn.XLOOKUP(\"BLACK\",$C$7:C69,$A$7:A69,\"\",0,-1),_xlfn.XLOOKUP(\"RED\",$C$7:C69,$A$7:A69,\"\",0,-1)),1),C69)","v":"BLACK"},{"$f":"IF(AND(COUNTIF($D$7:D69,\"RED\")>0,COUNTIF($D$7:D69,\"BLACK\")>0),A69-MIN(_xlfn.XLOOKUP(\"BLACK\",$D$7:D69,$A$7:A69,\"\",0,-1),_xlfn.XLOOKUP(\"RED\",$D$7:D69,$A$7:A69,\"\",0,-1)),A69-6)","v":3},"","","","","",295,"STOP",150,3]
[{"$f":"ROW()","v":70},27,{"$f":"_xlfn.XLOOKUP(B70,AUX!$A:$A,AUX!$B:$B,\"\",0,1)","v":"RED"},{"$f":"IF(C70=0,INDEX($C:$C,MAX(_xlfn.XLOOKUP(\"BLACK\",$C$7:C70,$A$7:A70,\"\",0,-1),_xlfn.XLOOKUP(\"RED\",$C$7:C70,$A$7:A70,\"\",0,-1)),1),C70)","v":"RED"},{"$f":"IF(AND(COUNTIF($D$7:D70,\"RED\")>0,COUNTIF($D$7:D70,\"BLACK\")>0),A70-MIN(_xlfn.XLOOKUP(\"BLACK\",$D$7:D70,$A$7:A70,\"\",0,-1),_xlfn.XLOOKUP(\"RED\",$D$7:D70,$A$7:A70,\"\",0,-1)),A70-6)","v":1},"","","","","",295,"",50,""]
[{"$f":"ROW()","v":71},29,{"$f":"_xlfn.XLOOKUP(B71,AUX!$A:$A,AUX!$B:$B,\"\",0,1)","v":"RED"},{"$f":"IF(C71=0,INDEX($C:$C,MAX(_xlfn.XLOOKUP(\"BLACK\",$C$7:C71,$A$7:A71,\"\",0,-1),_xlfn.XLOOKUP(\"RED\",$C$7:C71,$A$7:A71,\"\",0,-1)),1),C71)","v":"RED"},{"$f":"IF(AND(COUNTIF($D$7:D71,\"RED\")>0,COUNTIF($D$7:D71,\"BLACK\")>0),A71-MIN(_xlfn.XLOOKUP(\"BLACK\",$D$7:D71,$A$7:A71,\"\",0,-1),_xlfn.XLOOKUP(\"RED\",$D$7:D71,$A$7:A71,\"\",0,-1)),A71-6)","v":2},"BET","BLACK","FAIL",5,0,290,"STOP",100,2]
[{"$f":"ROW()","v":72},{"$f":"RANDBETWEEN(0,36)","v":16},{"$f":"_xlfn.XLOOKUP(B72,AUX!$A:$A,AUX!$B:$B,\"\",0,1)","v":"BLACK"},{"$f":"IF(C72=0,INDEX($C:$C,MAX(_xlfn.XLOOKUP(\"BLACK\",$C$7:C72,$A$7:A72,\"\",0,-1),_xlfn.XLOOKUP(\"RED\",$C$7:C72,$A$7:A72,\"\",0,-1)),1),C72)","v":"BLACK"},{"$f":"IF(AND(COUNTIF($D$7:D72,\"RED\")>0,COUNTIF($D$7:D72,\"BLACK\")>0),A72-MIN(_xlfn.XLOOKUP(\"BLACK\",$D$7:D72,$A$7:A72,\"\",0,-1),_xlfn.XLOOKUP(\"RED\",$D$7:D72,$A$7:A72,\"\",0,-1)),A72-6)","v":1},"","","","",{"$f":"IF(F72=\"BET\",IF(H72=\"SUCCESS\",I72*2,0),\"\")","v":""},{"$f":"IF(F72=\"BET\",K71-I72+J72,K71)","v":290},{"$f":"IF(OR(AND(H72=\"FAIL\",I72=$G$4),AND(L71=\"STOP\",E72>$E$3)),\"STOP\",\"\")","v":""},50,{"$f":"IF(E73<=E72,E72,\"\")","v":""}]
[{"$f":"ROW()","v":73},36,{"$f":"_xlfn.XLOOKUP(B73,AUX!$A:$A,AUX!$B:$B,\"\",0,1)","v":"BLACK"},{"$f":"IF(C73=0,INDEX($C:$C,MAX(_xlfn.XLOOKUP(\"BLACK\",$C$7:C73,$A$7:A73,\"\",0,-1),_xlfn.XLOOKUP(\"RED\",$C$7:C73,$A$7:A73,\"\",0,-1)),1),C73)","v":"BLACK"},{"$f":"IF(AND(COUNTIF($D$7:D73,\"RED\")>0,COUNTIF($D$7:D73,\"BLACK\")>0),A73-MIN(_xlfn.XLOOKUP(\"BLACK\",$D$7:D73,$A$7:A73,\"\",0,-1),_xlfn.XLOOKUP(\"RED\",$D$7:D73,$A$7:A73,\"\",0,-1)),A73-6)","v":2},{"$f":"IF(AND(E72>=$E$3,L72=\"\"),\"BET\",\"\")","v":"BET"},{"$f":"IF(F73=\"BET\",IF(D72=\"RED\",\"BLACK\",IF(D72=\"BLACK\",\"RED\",\"ERROR\")),\"\")","v":"RED"},{"$f":"IF(F73=\"BET\",IF(D73=G73,\"SUCCESS\",\"FAIL\"),\"\")","v":"FAIL"},{"$f":"IF(F73=\"BET\",IF(OR(I72>=$G$4,F72=\"\"),$F$3,IF(AND(F72=\"BET\",H72=\"FAIL\"),I72*2,$F$3)),\"\")","v":5},0,285,"STOP",{"$f":"E73*50","v":100},""]
[{"$f":"ROW()","v":74},22,{"$f":"_xlfn.XLOOKUP(B74,AUX!$A:$A,AUX!$B:$B,\"\",0,1)","v":"BLACK"},{"$f":"IF(C74=0,INDEX($C:$C,MAX(_xlfn.XLOOKUP(\"BLACK\",$C$7:C74,$A$7:A74,\"\",0,-1),_xlfn.XLOOKUP(\"RED\",$C$7:C74,$A$7:A74,\"\",0,-1)),1),C74)","v":"BLACK"},{"$f":"IF(AND(COUNTIF($D$7:D74,\"RED\")>0,COUNTIF($D$7:D74,\"BLACK\")>0),A74-MIN(_xlfn.XLOOKUP(\"BLACK\",$D$7:D74,$A$7:A74,\"\",0,-1),_xlfn.XLOOKUP(\"RED\",$D$7:D74,$A$7:A74,\"\",0,-1)),A74-6)","v":3},"","","","","",285,"STOP",150,""]
[{"$f":"ROW()","v":75},16,{"$f":"_xlfn.XLOOKUP(B75,AUX!$A:$A,AUX!$B:$B,\"\",0,1)","v":"BLACK"},{"$f":"IF(C75=0,INDEX($C:$C,MAX(_xlfn.XLOOKUP(\"BLACK\",$C$7:C75,$A$7:A75,\"\",0,-1),_xlfn.XLOOKUP(\"RED\",$C$7:C75,$A$7:A75,\"\",0,-1)),1),C75)","v":"BLACK"},{"$f":"IF(AND(COUNTIF($D$7:D75,\"RED\")>0,COUNTIF($D$7:D75,\"BLACK\")>0),A75-MIN(_xlfn.XLOOKUP(\"BLACK\",$D$7:D75,$A$7:A75,\"\",0,-1),_xlfn.XLOOKUP(\"RED\",$D$7:D75,$A$7:A75,\"\",0,-1)),A75-6)","v":4},"","","","","",285,"STOP",200,4]
[{"$f":"ROW()","v":76},35,{"$f":"_xlfn.XLOOKUP(B76,AUX!$A:$A,AUX!$B:$B,\"\",0,1)","v":"RED"},{"$f":"IF(C76=0,INDEX($C:$C,MAX(_xlfn.XLOOKUP(\"BLACK\",$C$7:C76,$A$7:A76,\"\",0,-1),_xlfn.XLOOKUP(\"RED\",$C$7:C76,$A$7:A76,\"\",0,-1)),1),C76)","v":"RED"},{"$f":"IF(AND(COUNTIF($D$7:D76,\"RED\")>0,COUNTIF($D$7:D76,\"BLACK\")>0),A76-MIN(_xlfn.XLOOKUP(\"BLACK\",$D$7:D76,$A$7:A76,\"\",0,-1),_xlfn.XLOOKUP(\"RED\",$D$7:D76,$A$7:A76,\"\",0,-1)),A76-6)","v":1},"","","","","",285,"",50,""]
[{"$f":"ROW()","v":77},19,{"$f":"_xlfn.XLOOKUP(B77,AUX!$A:$A,AUX!$B:$B,\"\",0,1)","v":"RED"},{"$f":"IF(C77=0,INDEX($C:$C,MAX(_xlfn.XLOOKUP(\"BLACK\",$C$7:C77,$A$7:A77,\"\",0,-1),_xlfn.XLOOKUP(\"RED\",$C$7:C77,$A$7:A77,\"\",0,-1)),1),C77)","v":"RED"},{"$f":"IF(AND(COUNTIF($D$7:D77,\"RED\")>0,COUNTIF($D$7:D77,\"BLACK\")>0),A77-MIN(_xlfn.XLOOKUP(\"BLACK\",$D$7:D77,$A$7:A77,\"\",0,-1),_xlfn.XLOOKUP(\"RED\",$D$7:D77,$A$7:A77,\"\",0,-1)),A77-6)","v":2},"BET","BLACK","FAIL",5,0,280,"STOP",100,2]
[{"$f":"ROW()","v":78},30,{"$f":"_xlfn.XLOOKUP(B78,AUX!$A:$A,AUX!$B:$B,\"\",0,1)","v":"BLACK"},{"$f":"IF(C78=0,INDEX($C:$C,MAX(_xlfn.XLOOKUP(\"BLACK\",$C$7:C78,$A$7:A78,\"\",0,-1),_xlfn.XLOOKUP(\"RED\",$C$7:C78,$A$7:A78,\"\",0,-1)),1),C78)","v":"BLACK"},{"$f":"IF(AND(COUNTIF($D$7:D78,\"RED\")>0,COUNTIF($D$7:D78,\"BLACK\")>0),A78-MIN(_xlfn.XLOOKUP(\"BLACK\",$D$7:D78,$A$7:A78,\"\",0,-1),_xlfn.XLOOKUP(\"RED\",$D$7:D78,$A$7:A78,\"\",0,-1)),A78-6)","v":1},"","","","","",280,"",50,1]
[{"$f":"ROW()","v":79},11,{"$f":"_xlfn.XLOOKUP(B79,AUX!$A:$A,AUX!$B:$B,\"\",0,1)","v":"RED"},{"$f":"IF(C79=0,INDEX($C:$C,MAX(_xlfn.XLOOKUP(\"BLACK\",$C$7:C79,$A$7:A79,\"\",0,-1),_xlfn.XLOOKUP(\"RED\",$C$7:C79,$A$7:A79,\"\",0,-1)),1),C79)","v":"RED"},{"$f":"IF(AND(COUNTIF($D$7:D79,\"RED\")>0,COUNTIF($D$7:D79,\"BLACK\")>0),A79-MIN(_xlfn.XLOOKUP(\"BLACK\",$D$7:D79,$A$7:A79,\"\",0,-1),_xlfn.XLOOKUP(\"RED\",$D$7:D79,$A$7:A79,\"\",0,-1)),A79-6)","v":1},"BET","RED","SUCCESS",5,10,285,"",50,1]
[{"$f":"ROW()","v":80},32,{"$f":"_xlfn.XLOOKUP(B80,AUX!$A:$A,AUX!$B:$B,\"\",0,1)","v":"BLACK"},{"$f":"IF(C80=0,INDEX($C:$C,MAX(_xlfn.XLOOKUP(\"BLACK\",$C$7:C80,$A$7:A80,\"\",0,-1),_xlfn.XLOOKUP(\"RED\",$C$7:C80,$A$7:A80,\"\",0,-1)),1),C80)","v":"BLACK"},{"$f":"IF(AND(COUNTIF($D$7:D80,\"RED\")>0,COUNTIF($D$7:D80,\"BLACK\")>0),A80-MIN(_xlfn.XLOOKUP(\"BLACK\",$D$7:D80,$A$7:A80,\"\",0,-1),_xlfn.XLOOKUP(\"RED\",$D$7:D80,$A$7:A80,\"\",0,-1)),A80-6)","v":1},"BET","BLACK","SUCCESS",5,10,290,"",50,""]
[{"$f":"ROW()","v":81},8,{"$f":"_xlfn.XLOOKUP(B81,AUX!$A:$A,AUX!$B:$B,\"\",0,1)","v":"BLACK"},{"$f":"IF(C81=0,INDEX($C:$C,MAX(_xlfn.XLOOKUP(\"BLACK\",$C$7:C81,$A$7:A81,\"\",0,-1),_xlfn.XLOOKUP(\"RED\",$C$7:C81,$A$7:A81,\"\",0,-1)),1),C81)","v":"BLACK"},{"$f":"IF(AND(COUNTIF($D$7:D81,\"RED\")>0,COUNTIF($D$7:D81,\"BLACK\")>0),A81-MIN(_xlfn.XLOOKUP(\"BLACK\",$D$7:D81,$A$7:A81,\"\",0,-1),_xlfn.XLOOKUP(\"RED\",$D$7:D81,$A$7:A81,\"\",0,-1)),A81-6)","v":2},"BET","RED","FAIL",5,0,285,"STOP",100,2]
[{"$f":"ROW()","v":82},3,{"$f":"_xlfn.XLOOKUP(B82,AUX!$A:$A,AUX!$B:$B,\"\",0,1)","v":"RED"},{"$f":"IF(C82=0,INDEX($C:$C,MAX(_xlfn.XLOOKUP(\"BLACK\",$C$7:C82,$A$7:A82,\"\",0,-1),_xlfn.XLOOKUP(\"RED\",$C$7:C82,$A$7:A82,\"\",0,-1)),1),C82)","v":"RED"},{"$f":"IF(AND(COUNTIF($D$7:D82,\"RED\")>0,COUNTIF($D$7:D82,\"BLACK\")>0),A82-MIN(_xlfn.XLOOKUP(\"BLACK\",$D$7:D82,$A$7:A82,\"\",0,-1),_xlfn.XLOOKUP(\"RED\",$D$7:D82,$A$7:A82,\"\",0,-1)),A82-6)","v":1},"","","","","",285,"",50,""]
[{"$f":"ROW()","v":83},25,{"$f":"_xlfn.XLOOKUP(B83,AUX!$A:$A,AUX!$B:$B,\"\",0,1)","v":"RED"},{"$f":"IF(C83=0,INDEX($C:$C,MAX(_xlfn.XLOOKUP(\"BLACK\",$C$7:C83,$A$7:A83,\"\",0,-1),_xlfn.XLOOKUP(\"RED\",$C$7:C83,$A$7:A83,\"\",0,-1)),1),C83)","v":"RED"},{"$f":"IF(AND(COUNTIF($D$7:D83,\"RED\")>0,COUNTIF($D$7:D83,\"BLACK\")>0),A83-MIN(_xlfn.XLOOKUP(\"BLACK\",$D$7:D83,$A$7:A83,\"\",0,-1),_xlfn.XLOOKUP(\"RED\",$D$7:D83,$A$7:A83,\"\",0,-1)),A83-6)","v":2},"BET","BLACK","FAIL",5,0,280,"STOP",100,""]
[{"$f":"ROW()","v":84},21,{"$f":"_xlfn.XLOOKUP(B84,AUX!$A:$A,AUX!$B:$B,\"\",0,1)","v":"RED"},{"$f":"IF(C84=0,INDEX($C:$C,MAX(_xlfn.XLOOKUP(\"BLACK\",$C$7:C84,$A$7:A84,\"\",0,-1),_xlfn.XLOOKUP(\"RED\",$C$7:C84,$A$7:A84,\"\",0,-1)),1),C84)","v":"RED"},{"$f":"IF(AND(COUNTIF($D$7:D84,\"RED\")>0,COUNTIF($D$7:D84,\"BLACK\")>0),A84-MIN(_xlfn.XLOOKUP(\"BLACK\",$D$7:D84,$A$7:A84,\"\",0,-1),_xlfn.XLOOKUP(\"RED\",$D$7:D84,$A$7:A84,\"\",0,-1)),A84-6)","v":3},"","","","","",280,"STOP",150,""]
[{"$f":"ROW()","v":85},0,{"$f":"_xlfn.XLOOKUP(B85,AUX!$A:$A,AUX!$B:$B,\"\",0,1)","v":0},{"$f":"IF(C85=0,INDEX($C:$C,MAX(_xlfn.XLOOKUP(\"BLACK\",$C$7:C85,$A$7:A85,\"\",0,-1),_xlfn.XLOOKUP(\"RED\",$C$7:C85,$A$7:A85,\"\",0,-1)),1),C85)","v":"RED"},{"$f":"IF(AND(COUNTIF($D$7:D85,\"RED\")>0,COUNTIF($D$7:D85,\"BLACK\")>0),A85-MIN(_xlfn.XLOOKUP(\"BLACK\",$D$7:D85,$A$7:A85,\"\",0,-1),_xlfn.XLOOKUP(\"RED\",$D$7:D85,$A$7:A85,\"\",0,-1)),A85-6)","v":4},"","","","","",280,"STOP",200,""]
[{"$f":"ROW()","v":86},13,{"$f":"_xlfn.XLOOKUP(B86,AUX!$A:$A,AUX!$B:$B,\"\",0,1)","v":"RED"},{"$f":"IF(C86=0,INDEX($C:$C,MAX(_xlfn.XLOOKUP(\"BLACK\",$C$7:C86,$A$7:A86,\"\",0,-1),_xlfn.XLOOKUP(\"RED\",$C$7:C86,$A$7:A86,\"\",0,-1)),1),C86)","v":"RED"},{"$f":"IF(AND(COUNTIF($D$7:D86,\"RED\")>0,COUNTIF($D$7:D86,\"BLACK\")>0),A86-MIN(_xlfn.XLOOKUP(\"BLACK\",$D$7:D86,$A$7:A86,\"\",0,-1),_xlfn.XLOOKUP(\"RED\",$D$7:D86,$A$7:A86,\"\",0,-1)),A86-6)","v":5},"","","","","",280,"STOP",250,5]
[{"$f":"ROW()","v":87},10,{"$f":"_xlfn.XLOOKUP(B87,AUX!$A:$A,AUX!$B:$B,\"\",0,1)","v":"BLACK"},{"$f":"IF(C87=0,INDEX($C:$C,MAX(_xlfn.XLOOKUP(\"BLACK\",$C$7:C87,$A$7:A87,\"\",0,-1),_xlfn.XLOOKUP(\"RED\",$C$7:C87,$A$7:A87,\"\",0,-1)),1),C87)","v":"BLACK"},{"$f":"IF(AND(COUNTIF($D$7:D87,\"RED\")>0,COUNTIF($D$7:D87,\"BLACK\")>0),A87-MIN(_xlfn.XLOOKUP(\"BLACK\",$D$7:D87,$A$7:A87,\"\",0,-1),_xlfn.XLOOKUP(\"RED\",$D$7:D87,$A$7:A87,\"\",0,-1)),A87-6)","v":1},"","","","","",280,"",50,""]
[{"$f":"ROW()","v":88},8,{"$f":"_xlfn.XLOOKUP(B88,AUX!$A:$A,AUX!$B:$B,\"\",0,1)","v":"BLACK"},{"$f":"IF(C88=0,INDEX($C:$C,MAX(_xlfn.XLOOKUP(\"BLACK\",$C$7:C88,$A$7:A88,\"\",0,-1),_xlfn.XLOOKUP(\"RED\",$C$7:C88,$A$7:A88,\"\",0,-1)),1),C88)","v":"BLACK"},{"$f":"IF(AND(COUNTIF($D$7:D88,\"RED\")>0,COUNTIF($D$7:D88,\"BLACK\")>0),A88-MIN(_xlfn.XLOOKUP(\"BLACK\",$D$7:D88,$A$7:A88,\"\",0,-1),_xlfn.XLOOKUP(\"RED\",$D$7:D88,$A$7:A88,\"\",0,-1)),A88-6)","v":2},"BET","RED","FAIL",5,0,275,"STOP",100,""]
[{"$f":"ROW()","v":89},22,{"$f":"_xlfn.XLOOKUP(B89,AUX!$A:$A,AUX!$B:$B,\"\",0,1)","v":"BLACK"},{"$f":"IF(C89=0,INDEX($C:$C,MAX(_xlfn.XLOOKUP(\"BLACK\",$C$7:C89,$A$7:A89,\"\",0,-1),_xlfn.XLOOKUP(\"RED\",$C$7:C89,$A$7:A89,\"\",0,-1)),1),C89)","v":"BLACK"},{"$f":"IF(AND(COUNTIF($D$7:D89,\"RED\")>0,COUNTIF($D$7:D89,\"BLACK\")>0),A89-MIN(_xlfn.XLOOKUP(\"BLACK\",$D$7:D89,$A$7:A89,\"\",0,-1),_xlfn.XLOOKUP(\"RED\",$D$7:D89,$A$7:A89,\"\",0,-1)),A89-6)","v":3},"","","","","",275,"STOP",150,""]
[{"$f":"ROW()","v":90},34,{"$f":"_xlfn.XLOOKUP(B90,AUX!$A:$A,AUX!$B:$B,\"\",0,1)","v":"BLACK"},{"$f":"IF(C90=0,INDEX($C:$C,MAX(_xlfn.XLOOKUP(\"BLACK\",$C$7:C90,$A$7:A90,\"\",0,-1),_xlfn.XLOOKUP(\"RED\",$C$7:C90,$A$7:A90,\"\",0,-1)),1),C90)","v":"BLACK"},{"$f":"IF(AND(COUNTIF($D$7:D90,\"RED\")>0,COUNTIF($D$7:D90,\"BLACK\")>0),A90-MIN(_xlfn.XLOOKUP(\"BLACK\",$D$7:D90,$A$7:A90,\"\",0,-1),_xlfn.XLOOKUP(\"RED\",$D$7:D90,$A$7:A90,\"\",0,-1)),A90-6)","v":4},"","","","","",275,"STOP",200,""]
[{"$f":"ROW()","v":91},18,{"$f":"_xlfn.XLOOKUP(B91,AUX!$A:$A,AUX!$B:$B,\"\",0,1)","v":"BLACK"},{"$f":"IF(C91=0,INDEX($C:$C,MAX(_xlfn.XLOOKUP(\"BLACK\",$C$7:C91,$A$7:A91,\"\",0,-1),_xlfn.XLOOKUP(\"RED\",$C$7:C91,$A$7:A91,\"\",0,-1)),1),C91)","v":"BLACK"},{"$f":"IF(AND(COUNTIF($D$7:D91,\"RED\")>0,COUNTIF($D$7:D91,\"BLACK\")>0),A91-MIN(_xlfn.XLOOKUP(\"BLACK\",$D$7:D91,$A$7:A91,\"\",0,-1),_xlfn.XLOOKUP(\"RED\",$D$7:D91,$A$7:A91,\"\",0,-1)),A91-6)","v":5},"","","","","",275,"STOP",250,5]
[{"$f":"ROW()","v":92},9,{"$f":"_xlfn.XLOOKUP(B92,AUX!$A:$A,AUX!$B:$B,\"\",0,1)","v":"RED"},{"$f":"IF(C92=0,INDEX($C:$C,MAX(_xlfn.XLOOKUP(\"BLACK\",$C$7:C92,$A$7:A92,\"\",0,-1),_xlfn.XLOOKUP(\"RED\",$C$7:C92,$A$7:A92,\"\",0,-1)),1),C92)","v":"RED"},{"$f":"IF(AND(COUNTIF($D$7:D92,\"RED\")>0,COUNTIF($D$7:D92,\"BLACK\")>0),A92-MIN(_xlfn.XLOOKUP(\"BLACK\",$D$7:D92,$A$7:A92,\"\",0,-1),_xlfn.XLOOKUP(\"RED\",$D$7:D92,$A$7:A92,\"\",0,-1)),A92-6)","v":1},"","","","","",275,"",50,""]
[{"$f":"ROW()","v":93},29,{"$f":"_xlfn.XLOOKUP(B93,AUX!$A:$A,AUX!$B:$B,\"\",0,1)","v":"RED"},{"$f":"IF(C93=0,INDEX($C:$C,MAX(_xlfn.XLOOKUP(\"BLACK\",$C$7:C93,$A$7:A93,\"\",0,-1),_xlfn.XLOOKUP(\"RED\",$C$7:C93,$A$7:A93,\"\",0,-1)),1),C93)","v":"RED"},{"$f":"IF(AND(COUNTIF($D$7:D93,\"RED\")>0,COUNTIF($D$7:D93,\"BLACK\")>0),A93-MIN(_xlfn.XLOOKUP(\"BLACK\",$D$7:D93,$A$7:A93,\"\",0,-1),_xlfn.XLOOKUP(\"RED\",$D$7:D93,$A$7:A93,\"\",0,-1)),A93-6)","v":2},"BET","BLACK","FAIL",5,0,270,"STOP",100,""]
[{"$f":"ROW()","v":94},33,{"$f":"_xlfn.XLOOKUP(B94,AUX!$A:$A,AUX!$B:$B,\"\",0,1)","v":"RED"},{"$f":"IF(C94=0,INDEX($C:$C,MAX(_xlfn.XLOOKUP(\"BLACK\",$C$7:C94,$A$7:A94,\"\",0,-1),_xlfn.XLOOKUP(\"RED\",$C$7:C94,$A$7:A94,\"\",0,-1)),1),C94)","v":"RED"},{"$f":"IF(AND(COUNTIF($D$7:D94,\"RED\")>0,COUNTIF($D$7:D94,\"BLACK\")>0),A94-MIN(_xlfn.XLOOKUP(\"BLACK\",$D$7:D94,$A$7:A94,\"\",0,-1),_xlfn.XLOOKUP(\"RED\",$D$7:D94,$A$7:A94,\"\",0,-1)),A94-6)","v":3},"","","","","",270,"STOP",150,3]
[{"$f":"ROW()","v":95},20,{"$f":"_xlfn.XLOOKUP(B95,AUX!$A:$A,AUX!$B:$B,\"\",0,1)","v":"BLACK"},{"$f":"IF(C95=0,INDEX($C:$C,MAX(_xlfn.XLOOKUP(\"BLACK\",$C$7:C95,$A$7:A95,\"\",0,-1),_xlfn.XLOOKUP(\"RED\",$C$7:C95,$A$7:A95,\"\",0,-1)),1),C95)","v":"BLACK"},{"$f":"IF(AND(COUNTIF($D$7:D95,\"RED\")>0,COUNTIF($D$7:D95,\"BLACK\")>0),A95-MIN(_xlfn.XLOOKUP(\"BLACK\",$D$7:D95,$A$7:A95,\"\",0,-1),_xlfn.XLOOKUP(\"RED\",$D$7:D95,$A$7:A95,\"\",0,-1)),A95-6)","v":1},"","","","","",270,"",50,1]
[{"$f":"ROW()","v":96},25,{"$f":"_xlfn.XLOOKUP(B96,AUX!$A:$A,AUX!$B:$B,\"\",0,1)","v":"RED"},{"$f":"IF(C96=0,INDEX($C:$C,MAX(_xlfn.XLOOKUP(\"BLACK\",$C$7:C96,$A$7:A96,\"\",0,-1),_xlfn.XLOOKUP(\"RED\",$C$7:C96,$A$7:A96,\"\",0,-1)),1),C96)","v":"RED"},{"$f":"IF(AND(COUNTIF($D$7:D96,\"RED\")>0,COUNTIF($D$7:D96,\"BLACK\")>0),A96-MIN(_xlfn.XLOOKUP(\"BLACK\",$D$7:D96,$A$7:A96,\"\",0,-1),_xlfn.XLOOKUP(\"RED\",$D$7:D96,$A$7:A96,\"\",0,-1)),A96-6)","v":1},"BET","RED","SUCCESS",5,10,275,"",50,1]
[{"$f":"ROW()","v":97},14,{"$f":"_xlfn.XLOOKUP(B97,AUX!$A:$A,AUX!$B:$B,\"\",0,1)","v":"BLACK"},{"$f":"IF(C97=0,INDEX($C:$C,MAX(_xlfn.XLOOKUP(\"BLACK\",$C$7:C97,$A$7:A97,\"\",0,-1),_xlfn.XLOOKUP(\"RED\",$C$7:C97,$A$7:A97,\"\",0,-1)),1),C97)","v":"BLACK"},{"$f":"IF(AND(COUNTIF($D$7:D97,\"RED\")>0,COUNTIF($D$7:D97,\"BLACK\")>0),A97-MIN(_xlfn.XLOOKUP(\"BLACK\",$D$7:D97,$A$7:A97,\"\",0,-1),_xlfn.XLOOKUP(\"RED\",$D$7:D97,$A$7:A97,\"\",0,-1)),A97-6)","v":1},"BET","BLACK","SUCCESS",5,10,280,"",50,""]
[{"$f":"ROW()","v":98},10,{"$f":"_xlfn.XLOOKUP(B98,AUX!$A:$A,AUX!$B:$B,\"\",0,1)","v":"BLACK"},{"$f":"IF(C98=0,INDEX($C:$C,MAX(_xlfn.XLOOKUP(\"BLACK\",$C$7:C98,$A$7:A98,\"\",0,-1),_xlfn.XLOOKUP(\"RED\",$C$7:C98,$A$7:A98,\"\",0,-1)),1),C98)","v":"BLACK"},{"$f":"IF(AND(COUNTIF($D$7:D98,\"RED\")>0,COUNTIF($D$7:D98,\"BLACK\")>0),A98-MIN(_xlfn.XLOOKUP(\"BLACK\",$D$7:D98,$A$7:A98,\"\",0,-1),_xlfn.XLOOKUP(\"RED\",$D$7:D98,$A$7:A98,\"\",0,-1)),A98-6)","v":2},"BET","RED","FAIL",5,0,275,"STOP",100,""]
[{"$f":"ROW()","v":99},6,{"$f":"_xlfn.XLOOKUP(B99,AUX!$A:$A,AUX!$B:$B,\"\",0,1)","v":"BLACK"},{"$f":"IF(C99=0,INDEX($C:$C,MAX(_xlfn.XLOOKUP(\"BLACK\",$C$7:C99,$A$7:A99,\"\",0,-1),_xlfn.XLOOKUP(\"RED\",$C$7:C99,$A$7:A99,\"\",0,-1)),1),C99)","v":"BLACK"},{"$f":"IF(AND(COUNTIF($D$7:D99,\"RED\")>0,COUNTIF($D$7:D99,\"BLACK\")>0),A99-MIN(_xlfn.XLOOKUP(\"BLACK\",$D$7:D99,$A$7:A99,\"\",0,-1),_xlfn.XLOOKUP(\"RED\",$D$7:D99,$A$7:A99,\"\",0,-1)),A99-6)","v":3},"","","","","",275,"STOP",150,3]
[{"$f":"ROW()","v":100},7,{"$f":"_xlfn.XLOOKUP(B100,AUX!$A:$A,AUX!$B:$B,\"\",0,1)","v":"RED"},{"$f":"IF(C100=0,INDEX($C:$C,MAX(_xlfn.XLOOKUP(\"BLACK\",$C$7:C100,$A$7:A100,\"\",0,-1),_xlfn.XLOOKUP(\"RED\",$C$7:C100,$A$7:A100,\"\",0,-1)),1),C100)","v":"RED"},{"$f":"IF(AND(COUNTIF($D$7:D100,\"RED\")>0,COUNTIF($D$7:D100,\"BLACK\")>0),A100-MIN(_xlfn.XLOOKUP(\"BLACK\",$D$7:D100,$A$7:A100,\"\",0,-1),_xlfn.XLOOKUP(\"RED\",$D$7:D100,$A$7:A100,\"\",0,-1)),A100-6)","v":1},"","","","","",275,"",50,""]
[{"$f":"ROW()","v":101},9,{"$f":"_xlfn.XLOOKUP(B101,AUX!$A:$A,AUX!$B:$B,\"\",0,1)","v":"RED"},{"$f":"IF(C101=0,INDEX($C:$C,MAX(_xlfn.XLOOKUP(\"BLACK\",$C$7:C101,$A$7:A101,\"\",0,-1),_xlfn.XLOOKUP(\"RED\",$C$7:C101,$A$7:A101,\"\",0,-1)),1),C101)","v":"RED"},{"$f":"IF(AND(COUNTIF($D$7:D101,\"RED\")>0,COUNTIF($D$7:D101,\"BLACK\")>0),A101-MIN(_xlfn.XLOOKUP(\"BLACK\",$D$7:D101,$A$7:A101,\"\",0,-1),_xlfn.XLOOKUP(\"RED\",$D$7:D101,$A$7:A101,\"\",0,-1)),A101-6)","v":2},"BET","BLACK","FAIL",5,0,270,"STOP",100,""]
[{"$f":"ROW()","v":102},27,{"$f":"_xlfn.XLOOKUP(B102,AUX!$A:$A,AUX!$B:$B,\"\",0,1)","v":"RED"},{"$f":"IF(C102=0,INDEX($C:$C,MAX(_xlfn.XLOOKUP(\"BLACK\",$C$7:C102,$A$7:A102,\"\",0,-1),_xlfn.XLOOKUP(\"RED\",$C$7:C102,$A$7:A102,\"\",0,-1)),1),C102)","v":"RED"},{"$f":"IF(AND(COUNTIF($D$7:D102,\"RED\")>0,COUNTIF($D$7:D102,\"BLACK\")>0),A102-MIN(_xlfn.XLOOKUP(\"BLACK\",$D$7:D102,$A$7:A102,\"\",0,-1),_xlfn.XLOOKUP(\"RED\",$D$7:D102,$A$7:A102,\"\",0,-1)),A102-6)","v":3},"","","","","",270,"STOP",150,""]
[{"$f":"ROW()","v":103},5,{"$f":"_xlfn.XLOOKUP(B103,AUX!$A:$A,AUX!$B:$B,\"\",0,1)","v":"RED"},{"$f":"IF(C103=0,INDEX($C:$C,MAX(_xlfn.XLOOKUP(\"BLACK\",$C$7:C103,$A$7:A103,\"\",0,-1),_xlfn.XLOOKUP(\"RED\",$C$7:C103,$A$7:A103,\"\",0,-1)),1),C103)","v":"RED"},{"$f":"IF(AND(COUNTIF($D$7:D103,\"RED\")>0,COUNTIF($D$7:D103,\"BLACK\")>0),A103-MIN(_xlfn.XLOOKUP(\"BLACK\",$D$7:D103,$A$7:A103,\"\",0,-1),_xlfn.XLOOKUP(\"RED\",$D$7:D103,$A$7:A103,\"\",0,-1)),A103-6)","v":4},"","","","","",270,"STOP",200,4]
[{"$f":"ROW()","v":104},32,{"$f":"_xlfn.XLOOKUP(B104,AUX!$A:$A,AUX!$B:$B,\"\",0,1)","v":"BLACK"},{"$f":"IF(C104=0,INDEX($C:$C,MAX(_xlfn.XLOOKUP(\"BLACK\",$C$7:C104,$A$7:A104,\"\",0,-1),_xlfn.XLOOKUP(\"RED\",$C$7:C104,$A$7:A104,\"\",0,-1)),1),C104)","v":"BLACK"},{"$f":"IF(AND(COUNTIF($D$7:D104,\"RED\")>0,COUNTIF($D$7:D104,\"BLACK\")>0),A104-MIN(_xlfn.XLOOKUP(\"BLACK\",$D$7:D104,$A$7:A104,\"\",0,-1),_xlfn.XLOOKUP(\"RED\",$D$7:D104,$A$7:A104,\"\",0,-1)),A104-6)","v":1},"","","","","",270,"",50,1]
[{"$f":"ROW()","v":105},33,{"$f":"_xlfn.XLOOKUP(B105,AUX!$A:$A,AUX!$B:$B,\"\",0,1)","v":"RED"},{"$f":"IF(C105=0,INDEX($C:$C,MAX(_xlfn.XLOOKUP(\"BLACK\",$C$7:C105,$A$7:A105,\"\",0,-1),_xlfn.XLOOKUP(\"RED\",$C$7:C105,$A$7:A105,\"\",0,-1)),1),C105)","v":"RED"},{"$f":"IF(AND(COUNTIF($D$7:D105,\"RED\")>0,COUNTIF($D$7:D105,\"BLACK\")>0),A105-MIN(_xlfn.XLOOKUP(\"BLACK\",$D$7:D105,$A$7:A105,\"\",0,-1),_xlfn.XLOOKUP(\"RED\",$D$7:D105,$A$7:A105,\"\",0,-1)),A105-6)","v":1},"BET","RED","SUCCESS",5,10,275,"",50,""]
[{"$f":"ROW()","v":106},21,{"$f":"_xlfn.XLOOKUP(B106,AUX!$A:$A,AUX!$B:$B,\"\",0,1)","v":"RED"},{"$f":"IF(C106=0,INDEX($C:$C,MAX(_xlfn.XLOOKUP(\"BLACK\",$C$7:C106,$A$7:A106,\"\",0,-1),_xlfn.XLOOKUP(\"RED\",$C$7:C106,$A$7:A106,\"\",0,-1)),1),C106)","v":"RED"},{"$f":"IF(AND(COUNTIF($D$7:D106,\"RED\")>0,COUNTIF($D$7:D106,\"BLACK\")>0),A106-MIN(_xlfn.XLOOKUP(\"BLACK\",$D$7:D106,$A$7:A106,\"\",0,-1),_xlfn.XLOOKUP(\"RED\",$D$7:D106,$A$7:A106,\"\",0,-1)),A106-6)","v":2},"BET","BLACK","FAIL",5,0,270,"STOP",100,2]
[{"$f":"ROW()","v":107},28,{"$f":"_xlfn.XLOOKUP(B107,AUX!$A:$A,AUX!$B:$B,\"\",0,1)","v":"BLACK"},{"$f":"IF(C107=0,INDEX($C:$C,MAX(_xlfn.XLOOKUP(\"BLACK\",$C$7:C107,$A$7:A107,\"\",0,-1),_xlfn.XLOOKUP(\"RED\",$C$7:C107,$A$7:A107,\"\",0,-1)),1),C107)","v":"BLACK"},{"$f":"IF(AND(COUNTIF($D$7:D107,\"RED\")>0,COUNTIF($D$7:D107,\"BLACK\")>0),A107-MIN(_xlfn.XLOOKUP(\"BLACK\",$D$7:D107,$A$7:A107,\"\",0,-1),_xlfn.XLOOKUP(\"RED\",$D$7:D107,$A$7:A107,\"\",0,-1)),A107-6)","v":1},"","","","","",270,"",50,""]
[{"$f":"ROW()","v":108},10,{"$f":"_xlfn.XLOOKUP(B108,AUX!$A:$A,AUX!$B:$B,\"\",0,1)","v":"BLACK"},{"$f":"IF(C108=0,INDEX($C:$C,MAX(_xlfn.XLOOKUP(\"BLACK\",$C$7:C108,$A$7:A108,\"\",0,-1),_xlfn.XLOOKUP(\"RED\",$C$7:C108,$A$7:A108,\"\",0,-1)),1),C108)","v":"BLACK"},{"$f":"IF(AND(COUNTIF($D$7:D108,\"RED\")>0,COUNTIF($D$7:D108,\"BLACK\")>0),A108-MIN(_xlfn.XLOOKUP(\"BLACK\",$D$7:D108,$A$7:A108,\"\",0,-1),_xlfn.XLOOKUP(\"RED\",$D$7:D108,$A$7:A108,\"\",0,-1)),A108-6)","v":2},"BET","RED","FAIL",5,0,265,"STOP",100,""]
[{"$f":"ROW()","v":109},16,{"$f":"_xlfn.XLOOKUP(B109,AUX!$A:$A,AUX!$B:$B,\"\",0,1)","v":"BLACK"},{"$f":"IF(C109=0,INDEX($C:$C,MAX(_xlfn.XLOOKUP(\"BLACK\",$C$7:C109,$A$7:A109,\"\",0,-1),_xlfn.XLOOKUP(\"RED\",$C$7:C109,$A$7:A109,\"\",0,-1)),1),C109)","v":"BLACK"},{"$f":"IF(AND(COUNTIF($D$7:D109,\"RED\")>0,COUNTIF($D$7:D109,\"BLACK\")>0),A109-MIN(_xlfn.XLOOKUP(\"BLACK\",$D$7:D109,$A$7:A109,\"\",0,-1),_xlfn.XLOOKUP(\"RED\",$D$7:D109,$A$7:A109,\"\",0,-1)),A109-6)","v":3},"","","","","",265,"STOP",150,3]
[{"$f":"ROW()","v":110},35,{"$f":"_xlfn.XLOOKUP(B110,AUX!$A:$A,AUX!$B:$B,\"\",0,1)","v":"RED"},{"$f":"IF(C110=0,INDEX($C:$C,MAX(_xlfn.XLOOKUP(\"BLACK\",$C$7:C110,$A$7:A110,\"\",0,-1),_xlfn.XLOOKUP(\"RED\",$C$7:C110,$A$7:A110,\"\",0,-1)),1),C110)","v":"RED"},{"$f":"IF(AND(COUNTIF($D$7:D110,\"RED\")>0,COUNTIF($D$7:D110,\"BLACK\")>0),A110-MIN(_xlfn.XLOOKUP(\"BLACK\",$D$7:D110,$A$7:A110,\"\",0,-1),_xlfn.XLOOKUP(\"RED\",$D$7:D110,$A$7:A110,\"\",0,-1)),A110-6)","v":1},"","","","","",265,"",50,""]
[{"$f":"ROW()","v":111},17,{"$f":"_xlfn.XLOOKUP(B111,AUX!$A:$A,AUX!$B:$B,\"\",0,1)","v":"RED"},{"$f":"IF(C111=0,INDEX($C:$C,MAX(_xlfn.XLOOKUP(\"BLACK\",$C$7:C111,$A$7:A111,\"\",0,-1),_xlfn.XLOOKUP(\"RED\",$C$7:C111,$A$7:A111,\"\",0,-1)),1),C111)","v":"RED"},{"$f":"IF(AND(COUNTIF($D$7:D111,\"RED\")>0,COUNTIF($D$7:D111,\"BLACK\")>0),A111-MIN(_xlfn.XLOOKUP(\"BLACK\",$D$7:D111,$A$7:A111,\"\",0,-1),_xlfn.XLOOKUP(\"RED\",$D$7:D111,$A$7:A111,\"\",0,-1)),A111-6)","v":2},"BET","BLACK","FAIL",5,0,260,"STOP",100,""]
[{"$f":"ROW()","v":112},7,{"$f":"_xlfn.XLOOKUP(B112,AUX!$A:$A,AUX!$B:$B,\"\",0,1)","v":"RED"},{"$f":"IF(C112=0,INDEX($C:$C,MAX(_xlfn.XLOOKUP(\"BLACK\",$C$7:C112,$A$7:A112,\"\",0,-1),_xlfn.XLOOKUP(\"RED\",$C$7:C112,$A$7:A112,\"\",0,-1)),1),C112)","v":"RED"},{"$f":"IF(AND(COUNTIF($D$7:D112,\"RED\")>0,COUNTIF($D$7:D112,\"BLACK\")>0),A112-MIN(_xlfn.XLOOKUP(\"BLACK\",$D$7:D112,$A$7:A112,\"\",0,-1),_xlfn.XLOOKUP(\"RED\",$D$7:D112,$A$7:A112,\"\",0,-1)),A112-6)","v":3},"","","","","",260,"STOP",150,""]
[{"$f":"ROW()","v":113},27,{"$f":"_xlfn.XLOOKUP(B113,AUX!$A:$A,AUX!$B:$B,\"\",0,1)","v":"RED"},{"$f":"IF(C113=0,INDEX($C:$C,MAX(_xlfn.XLOOKUP(\"BLACK\",$C$7:C113,$A$7:A113,\"\",0,-1),_xlfn.XLOOKUP(\"RED\",$C$7:C113,$A$7:A113,\"\",0,-1)),1),C113)","v":"RED"},{"$f":"IF(AND(COUNTIF($D$7:D113,\"RED\")>0,COUNTIF($D$7:D113,\"BLACK\")>0),A113-MIN(_xlfn.XLOOKUP(\"BLACK\",$D$7:D113,$A$7:A113,\"\",0,-1),_xlfn.XLOOKUP(\"RED\",$D$7:D113,$A$7:A113,\"\",0,-1)),A113-6)","v":4},"","","","","",260,"STOP",200,4]
[{"$f":"ROW()","v":114},4,{"$f":"_xlfn.XLOOKUP(B114,AUX!$A:$A,AUX!$B:$B,\"\",0,1)","v":"BLACK"},{"$f":"IF(C114=0,INDEX($C:$C,MAX(_xlfn.XLOOKUP(\"BLACK\",$C$7:C114,$A$7:A114,\"\",0,-1),_xlfn.XLOOKUP(\"RED\",$C$7:C114,$A$7:A114,\"\",0,-1)),1),C114)","v":"BLACK"},{"$f":"IF(AND(COUNTIF($D$7:D114,\"RED\")>0,COUNTIF($D$7:D114,\"BLACK\")>0),A114-MIN(_xlfn.XLOOKUP(\"BLACK\",$D$7:D114,$A$7:A114,\"\",0,-1),_xlfn.XLOOKUP(\"RED\",$D$7:D114,$A$7:A114,\"\",0,-1)),A114-6)","v":1},"","","","","",260,"",50,1]
[{"$f":"ROW()","v":115},13,{"$f":"_xlfn.XLOOKUP(B115,AUX!$A:$A,AUX!$B:$B,\"\",0,1)","v":"RED"},{"$f":"IF(C115=0,INDEX($C:$C,MAX(_xlfn.XLOOKUP(\"BLACK\",$C$7:C115,$A$7:A115,\"\",0,-1),_xlfn.XLOOKUP(\"RED\",$C$7:C115,$A$7:A115,\"\",0,-1)),1),C115)","v":"RED"},{"$f":"IF(AND(COUNTIF($D$7:D115,\"RED\")>0,COUNTIF($D$7:D115,\"BLACK\")>0),A115-MIN(_xlfn.XLOOKUP(\"BLACK\",$D$7:D115,$A$7:A115,\"\",0,-1),_xlfn.XLOOKUP(\"RED\",$D$7:D115,$A$7:A115,\"\",0,-1)),A115-6)","v":1},"BET","RED","SUCCESS",5,10,265,"",50,1]
[{"$f":"ROW()","v":116},16,{"$f":"_xlfn.XLOOKUP(B116,AUX!$A:$A,AUX!$B:$B,\"\",0,1)","v":"BLACK"},{"$f":"IF(C116=0,INDEX($C:$C,MAX(_xlfn.XLOOKUP(\"BLACK\",$C$7:C116,$A$7:A116,\"\",0,-1),_xlfn.XLOOKUP(\"RED\",$C$7:C116,$A$7:A116,\"\",0,-1)),1),C116)","v":"BLACK"},{"$f":"IF(AND(COUNTIF($D$7:D116,\"RED\")>0,COUNTIF($D$7:D116,\"BLACK\")>0),A116-MIN(_xlfn.XLOOKUP(\"BLACK\",$D$7:D116,$A$7:A116,\"\",0,-1),_xlfn.XLOOKUP(\"RED\",$D$7:D116,$A$7:A116,\"\",0,-1)),A116-6)","v":1},"BET","BLACK","SUCCESS",5,10,270,"",50,1]
[{"$f":"ROW()","v":117},1,{"$f":"_xlfn.XLOOKUP(B117,AUX!$A:$A,AUX!$B:$B,\"\",0,1)","v":"RED"},{"$f":"IF(C117=0,INDEX($C:$C,MAX(_xlfn.XLOOKUP(\"BLACK\",$C$7:C117,$A$7:A117,\"\",0,-1),_xlfn.XLOOKUP(\"RED\",$C$7:C117,$A$7:A117,\"\",0,-1)),1),C117)","v":"RED"},{"$f":"IF(AND(COUNTIF($D$7:D117,\"RED\")>0,COUNTIF($D$7:D117,\"BLACK\")>0),A117-MIN(_xlfn.XLOOKUP(\"BLACK\",$D$7:D117,$A$7:A117,\"\",0,-1),_xlfn.XLOOKUP(\"RED\",$D$7:D117,$A$7:A117,\"\",0,-1)),A117-6)","v":1},"BET","RED","SUCCESS",5,10,275,"",50,1]
[{"$f":"ROW()","v":118},36,{"$f":"_xlfn.XLOOKUP(B118,AUX!$A:$A,AUX!$B:$B,\"\",0,1)","v":"BLACK"},{"$f":"IF(C118=0,INDEX($C:$C,MAX(_xlfn.XLOOKUP(\"BLACK\",$C$7:C118,$A$7:A118,\"\",0,-1),_xlfn.XLOOKUP(\"RED\",$C$7:C118,$A$7:A118,\"\",0,-1)),1),C118)","v":"BLACK"},{"$f":"IF(AND(COUNTIF($D$7:D118,\"RED\")>0,COUNTIF($D$7:D118,\"BLACK\")>0),A118-MIN(_xlfn.XLOOKUP(\"BLACK\",$D$7:D118,$A$7:A118,\"\",0,-1),_xlfn.XLOOKUP(\"RED\",$D$7:D118,$A$7:A118,\"\",0,-1)),A118-6)","v":1},"BET","BLACK","SUCCESS",5,10,280,"",50,1]
[{"$f":"ROW()","v":119},35,{"$f":"_xlfn.XLOOKUP(B119,AUX!$A:$A,AUX!$B:$B,\"\",0,1)","v":"RED"},{"$f":"IF(C119=0,INDEX($C:$C,MAX(_xlfn.XLOOKUP(\"BLACK\",$C$7:C119,$A$7:A119,\"\",0,-1),_xlfn.XLOOKUP(\"RED\",$C$7:C119,$A$7:A119,\"\",0,-1)),1),C119)","v":"RED"},{"$f":"IF(AND(COUNTIF($D$7:D119,\"RED\")>0,COUNTIF($D$7:D119,\"BLACK\")>0),A119-MIN(_xlfn.XLOOKUP(\"BLACK\",$D$7:D119,$A$7:A119,\"\",0,-1),_xlfn.XLOOKUP(\"RED\",$D$7:D119,$A$7:A119,\"\",0,-1)),A119-6)","v":1},"BET","RED","SUCCESS",5,10,285,"",50,""]
[{"$f":"ROW()","v":120},11,{"$f":"_xlfn.XLOOKUP(B120,AUX!$A:$A,AUX!$B:$B,\"\",0,1)","v":"RED"},{"$f":"IF(C120=0,INDEX($C:$C,MAX(_xlfn.XLOOKUP(\"BLACK\",$C$7:C120,$A$7:A120,\"\",0,-1),_xlfn.XLOOKUP(\"RED\",$C$7:C120,$A$7:A120,\"\",0,-1)),1),C120)","v":"RED"},{"$f":"IF(AND(COUNTIF($D$7:D120,\"RED\")>0,COUNTIF($D$7:D120,\"BLACK\")>0),A120-MIN(_xlfn.XLOOKUP(\"BLACK\",$D$7:D120,$A$7:A120,\"\",0,-1),_xlfn.XLOOKUP(\"RED\",$D$7:D120,$A$7:A120,\"\",0,-1)),A120-6)","v":2},"BET","BLACK","FAIL",5,0,280,"STOP",100,2]
[{"$f":"ROW()","v":121},8,{"$f":"_xlfn.XLOOKUP(B121,AUX!$A:$A,AUX!$B:$B,\"\",0,1)","v":"BLACK"},{"$f":"IF(C121=0,INDEX($C:$C,MAX(_xlfn.XLOOKUP(\"BLACK\",$C$7:C121,$A$7:A121,\"\",0,-1),_xlfn.XLOOKUP(\"RED\",$C$7:C121,$A$7:A121,\"\",0,-1)),1),C121)","v":"BLACK"},{"$f":"IF(AND(COUNTIF($D$7:D121,\"RED\")>0,COUNTIF($D$7:D121,\"BLACK\")>0),A121-MIN(_xlfn.XLOOKUP(\"BLACK\",$D$7:D121,$A$7:A121,\"\",0,-1),_xlfn.XLOOKUP(\"RED\",$D$7:D121,$A$7:A121,\"\",0,-1)),A121-6)","v":1},"","","","","",280,"",50,1]
[{"$f":"ROW()","v":122},13,{"$f":"_xlfn.XLOOKUP(B122,AUX!$A:$A,AUX!$B:$B,\"\",0,1)","v":"RED"},{"$f":"IF(C122=0,INDEX($C:$C,MAX(_xlfn.XLOOKUP(\"BLACK\",$C$7:C122,$A$7:A122,\"\",0,-1),_xlfn.XLOOKUP(\"RED\",$C$7:C122,$A$7:A122,\"\",0,-1)),1),C122)","v":"RED"},{"$f":"IF(AND(COUNTIF($D$7:D122,\"RED\")>0,COUNTIF($D$7:D122,\"BLACK\")>0),A122-MIN(_xlfn.XLOOKUP(\"BLACK\",$D$7:D122,$A$7:A122,\"\",0,-1),_xlfn.XLOOKUP(\"RED\",$D$7:D122,$A$7:A122,\"\",0,-1)),A122-6)","v":1},"BET","RED","SUCCESS",5,10,285,"",50,1]
[{"$f":"ROW()","v":123},36,{"$f":"_xlfn.XLOOKUP(B123,AUX!$A:$A,AUX!$B:$B,\"\",0,1)","v":"BLACK"},{"$f":"IF(C123=0,INDEX($C:$C,MAX(_xlfn.XLOOKUP(\"BLACK\",$C$7:C123,$A$7:A123,\"\",0,-1),_xlfn.XLOOKUP(\"RED\",$C$7:C123,$A$7:A123,\"\",0,-1)),1),C123)","v":"BLACK"},{"$f":"IF(AND(COUNTIF($D$7:D123,\"RED\")>0,COUNTIF($D$7:D123,\"BLACK\")>0),A123-MIN(_xlfn.XLOOKUP(\"BLACK\",$D$7:D123,$A$7:A123,\"\",0,-1),_xlfn.XLOOKUP(\"RED\",$D$7:D123,$A$7:A123,\"\",0,-1)),A123-6)","v":1},"BET","BLACK","SUCCESS",5,10,290,"",50,1]
[{"$f":"ROW()","v":124},13,{"$f":"_xlfn.XLOOKUP(B124,AUX!$A:$A,AUX!$B:$B,\"\",0,1)","v":"RED"},{"$f":"IF(C124=0,INDEX($C:$C,MAX(_xlfn.XLOOKUP(\"BLACK\",$C$7:C124,$A$7:A124,\"\",0,-1),_xlfn.XLOOKUP(\"RED\",$C$7:C124,$A$7:A124,\"\",0,-1)),1),C124)","v":"RED"},{"$f":"IF(AND(COUNTIF($D$7:D124,\"RED\")>0,COUNTIF($D$7:D124,\"BLACK\")>0),A124-MIN(_xlfn.XLOOKUP(\"BLACK\",$D$7:D124,$A$7:A124,\"\",0,-1),_xlfn.XLOOKUP(\"RED\",$D$7:D124,$A$7:A124,\"\",0,-1)),A124-6)","v":1},"BET","RED","SUCCESS",5,10,295,"",50,1]
[{"$f":"ROW()","v":125},6,{"$f":"_xlfn.XLOOKUP(B125,AUX!$A:$A,AUX!$B:$B,\"\",0,1)","v":"BLACK"},{"$f":"IF(C125=0,INDEX($C:$C,MAX(_xlfn.XLOOKUP(\"BLACK\",$C$7:C125,$A$7:A125,\"\",0,-1),_xlfn.XLOOKUP(\"RED\",$C$7:C125,$A$7:A125,\"\",0,-1)),1),C125)","v":"BLACK"},{"$f":"IF(AND(COUNTIF($D$7:D125,\"RED\")>0,COUNTIF($D$7:D125,\"BLACK\")>0),A125-MIN(_xlfn.XLOOKUP(\"BLACK\",$D$7:D125,$A$7:A125,\"\",0,-1),_xlfn.XLOOKUP(\"RED\",$D$7:D125,$A$7:A125,\"\",0,-1)),A125-6)","v":1},"BET","BLACK","SUCCESS",5,10,300,"",50,""]
[{"$f":"ROW()","v":126},36,{"$f":"_xlfn.XLOOKUP(B126,AUX!$A:$A,AUX!$B:$B,\"\",0,1)","v":"BLACK"},{"$f":"IF(C126=0,INDEX($C:$C,MAX(_xlfn.XLOOKUP(\"BLACK\",$C$7:C126,$A$7:A126,\"\",0,-1),_xlfn.XLOOKUP(\"RED\",$C$7:C126,$A$7:A126,\"\",0,-1)),1),C126)","v":"BLACK"},{"$f":"IF(AND(COUNTIF($D$7:D126,\"RED\")>0,COUNTIF($D$7:D126,\"BLACK\")>0),A126-MIN(_xlfn.XLOOKUP(\"BLACK\",$D$7:D126,$A$7:A126,\"\",0,-1),_xlfn.XLOOKUP(\"RED\",$D$7:D126,$A$7:A126,\"\",0,-1)),A126-6)","v":2},"BET","RED","FAIL",5,0,295,"STOP",100,2]
[{"$f":"ROW()","v":127},25,{"$f":"_xlfn.XLOOKUP(B127,AUX!$A:$A,AUX!$B:$B,\"\",0,1)","v":"RED"},{"$f":"IF(C127=0,INDEX($C:$C,MAX(_xlfn.XLOOKUP(\"BLACK\",$C$7:C127,$A$7:A127,\"\",0,-1),_xlfn.XLOOKUP(\"RED\",$C$7:C127,$A$7:A127,\"\",0,-1)),1),C127)","v":"RED"},{"$f":"IF(AND(COUNTIF($D$7:D127,\"RED\")>0,COUNTIF($D$7:D127,\"BLACK\")>0),A127-MIN(_xlfn.XLOOKUP(\"BLACK\",$D$7:D127,$A$7:A127,\"\",0,-1),_xlfn.XLOOKUP(\"RED\",$D$7:D127,$A$7:A127,\"\",0,-1)),A127-6)","v":1},"","","","","",295,"",50,1]
[{"$f":"ROW()","v":128},36,{"$f":"_xlfn.XLOOKUP(B128,AUX!$A:$A,AUX!$B:$B,\"\",0,1)","v":"BLACK"},{"$f":"IF(C128=0,INDEX($C:$C,MAX(_xlfn.XLOOKUP(\"BLACK\",$C$7:C128,$A$7:A128,\"\",0,-1),_xlfn.XLOOKUP(\"RED\",$C$7:C128,$A$7:A128,\"\",0,-1)),1),C128)","v":"BLACK"},{"$f":"IF(AND(COUNTIF($D$7:D128,\"RED\")>0,COUNTIF($D$7:D128,\"BLACK\")>0),A128-MIN(_xlfn.XLOOKUP(\"BLACK\",$D$7:D128,$A$7:A128,\"\",0,-1),_xlfn.XLOOKUP(\"RED\",$D$7:D128,$A$7:A128,\"\",0,-1)),A128-6)","v":1},"BET","BLACK","SUCCESS",5,10,300,"",50,""]
[{"$f":"ROW()","v":129},4,{"$f":"_xlfn.XLOOKUP(B129,AUX!$A:$A,AUX!$B:$B,\"\",0,1)","v":"BLACK"},{"$f":"IF(C129=0,INDEX($C:$C,MAX(_xlfn.XLOOKUP(\"BLACK\",$C$7:C129,$A$7:A129,\"\",0,-1),_xlfn.XLOOKUP(\"RED\",$C$7:C129,$A$7:A129,\"\",0,-1)),1),C129)","v":"BLACK"},{"$f":"IF(AND(COUNTIF($D$7:D129,\"RED\")>0,COUNTIF($D$7:D129,\"BLACK\")>0),A129-MIN(_xlfn.XLOOKUP(\"BLACK\",$D$7:D129,$A$7:A129,\"\",0,-1),_xlfn.XLOOKUP(\"RED\",$D$7:D129,$A$7:A129,\"\",0,-1)),A129-6)","v":2},"BET","RED","FAIL",5,0,295,"STOP",100,""]
[{"$f":"ROW()","v":130},4,{"$f":"_xlfn.XLOOKUP(B130,AUX!$A:$A,AUX!$B:$B,\"\",0,1)","v":"BLACK"},{"$f":"IF(C130=0,INDEX($C:$C,MAX(_xlfn.XLOOKUP(\"BLACK\",$C$7:C130,$A$7:A130,\"\",0,-1),_xlfn.XLOOKUP(\"RED\",$C$7:C130,$A$7:A130,\"\",0,-1)),1),C130)","v":"BLACK"},{"$f":"IF(AND(COUNTIF($D$7:D130,\"RED\")>0,COUNTIF($D$7:D130,\"BLACK\")>0),A130-MIN(_xlfn.XLOOKUP(\"BLACK\",$D$7:D130,$A$7:A130,\"\",0,-1),_xlfn.XLOOKUP(\"RED\",$D$7:D130,$A$7:A130,\"\",0,-1)),A130-6)","v":3},"","","","","",295,"STOP",150,3]
[{"$f":"ROW()","v":131},3,{"$f":"_xlfn.XLOOKUP(B131,AUX!$A:$A,AUX!$B:$B,\"\",0,1)","v":"RED"},{"$f":"IF(C131=0,INDEX($C:$C,MAX(_xlfn.XLOOKUP(\"BLACK\",$C$7:C131,$A$7:A131,\"\",0,-1),_xlfn.XLOOKUP(\"RED\",$C$7:C131,$A$7:A131,\"\",0,-1)),1),C131)","v":"RED"},{"$f":"IF(AND(COUNTIF($D$7:D131,\"RED\")>0,COUNTIF($D$7:D131,\"BLACK\")>0),A131-MIN(_xlfn.XLOOKUP(\"BLACK\",$D$7:D131,$A$7:A131,\"\",0,-1),_xlfn.XLOOKUP(\"RED\",$D$7:D131,$A$7:A131,\"\",0,-1)),A131-6)","v":1},"","","","","",295,"",50,""]
[{"$f":"ROW()","v":132},23,{"$f":"_xlfn.XLOOKUP(B132,AUX!$A:$A,AUX!$B:$B,\"\",0,1)","v":"RED"},{"$f":"IF(C132=0,INDEX($C:$C,MAX(_xlfn.XLOOKUP(\"BLACK\",$C$7:C132,$A$7:A132,\"\",0,-1),_xlfn.XLOOKUP(\"RED\",$C$7:C132,$A$7:A132,\"\",0,-1)),1),C132)","v":"RED"},{"$f":"IF(AND(COUNTIF($D$7:D132,\"RED\")>0,COUNTIF($D$7:D132,\"BLACK\")>0),A132-MIN(_xlfn.XLOOKUP(\"BLACK\",$D$7:D132,$A$7:A132,\"\",0,-1),_xlfn.XLOOKUP(\"RED\",$D$7:D132,$A$7:A132,\"\",0,-1)),A132-6)","v":2},"BET","BLACK","FAIL",5,0,290,"STOP",100,""]
[{"$f":"ROW()","v":133},1,{"$f":"_xlfn.XLOOKUP(B133,AUX!$A:$A,AUX!$B:$B,\"\",0,1)","v":"RED"},{"$f":"IF(C133=0,INDEX($C:$C,MAX(_xlfn.XLOOKUP(\"BLACK\",$C$7:C133,$A$7:A133,\"\",0,-1),_xlfn.XLOOKUP(\"RED\",$C$7:C133,$A$7:A133,\"\",0,-1)),1),C133)","v":"RED"},{"$f":"IF(AND(COUNTIF($D$7:D133,\"RED\")>0,COUNTIF($D$7:D133,\"BLACK\")>0),A133-MIN(_xlfn.XLOOKUP(\"BLACK\",$D$7:D133,$A$7:A133,\"\",0,-1),_xlfn.XLOOKUP(\"RED\",$D$7:D133,$A$7:A133,\"\",0,-1)),A133-6)","v":3},"","","","","",290,"STOP",150,3]
[{"$f":"ROW()","v":134},26,{"$f":"_xlfn.XLOOKUP(B134,AUX!$A:$A,AUX!$B:$B,\"\",0,1)","v":"BLACK"},{"$f":"IF(C134=0,INDEX($C:$C,MAX(_xlfn.XLOOKUP(\"BLACK\",$C$7:C134,$A$7:A134,\"\",0,-1),_xlfn.XLOOKUP(\"RED\",$C$7:C134,$A$7:A134,\"\",0,-1)),1),C134)","v":"BLACK"},{"$f":"IF(AND(COUNTIF($D$7:D134,\"RED\")>0,COUNTIF($D$7:D134,\"BLACK\")>0),A134-MIN(_xlfn.XLOOKUP(\"BLACK\",$D$7:D134,$A$7:A134,\"\",0,-1),_xlfn.XLOOKUP(\"RED\",$D$7:D134,$A$7:A134,\"\",0,-1)),A134-6)","v":1},"","","","","",290,"",50,""]
[{"$f":"ROW()","v":135},2,{"$f":"_xlfn.XLOOKUP(B135,AUX!$A:$A,AUX!$B:$B,\"\",0,1)","v":"BLACK"},{"$f":"IF(C135=0,INDEX($C:$C,MAX(_xlfn.XLOOKUP(\"BLACK\",$C$7:C135,$A$7:A135,\"\",0,-1),_xlfn.XLOOKUP(\"RED\",$C$7:C135,$A$7:A135,\"\",0,-1)),1),C135)","v":"BLACK"},{"$f":"IF(AND(COUNTIF($D$7:D135,\"RED\")>0,COUNTIF($D$7:D135,\"BLACK\")>0),A135-MIN(_xlfn.XLOOKUP(\"BLACK\",$D$7:D135,$A$7:A135,\"\",0,-1),_xlfn.XLOOKUP(\"RED\",$D$7:D135,$A$7:A135,\"\",0,-1)),A135-6)","v":2},"BET","RED","FAIL",5,0,285,"STOP",100,2]
[{"$f":"ROW()","v":136},{"$f":"RANDBETWEEN(0,36)","v":25},{"$f":"_xlfn.XLOOKUP(B136,AUX!$A:$A,AUX!$B:$B,\"\",0,1)","v":"RED"},{"$f":"IF(C136=0,INDEX($C:$C,MAX(_xlfn.XLOOKUP(\"BLACK\",$C$7:C136,$A$7:A136,\"\",0,-1),_xlfn.XLOOKUP(\"RED\",$C$7:C136,$A$7:A136,\"\",0,-1)),1),C136)","v":"RED"},{"$f":"IF(AND(COUNTIF($D$7:D136,\"RED\")>0,COUNTIF($D$7:D136,\"BLACK\")>0),A136-MIN(_xlfn.XLOOKUP(\"BLACK\",$D$7:D136,$A$7:A136,\"\",0,-1),_xlfn.XLOOKUP(\"RED\",$D$7:D136,$A$7:A136,\"\",0,-1)),A136-6)","v":1},"","","","",{"$f":"IF(F136=\"BET\",IF(H136=\"SUCCESS\",I136*2,0),\"\")","v":""},{"$f":"IF(F136=\"BET\",K135-I136+J136,K135)","v":285},{"$f":"IF(OR(AND(H136=\"FAIL\",I136=$G$4),AND(L135=\"STOP\",E136>$E$3)),\"STOP\",\"\")","v":""},50,{"$f":"IF(E137<=E136,E136,\"\")","v":1}]
[{"$f":"ROW()","v":137},36,{"$f":"_xlfn.XLOOKUP(B137,AUX!$A:$A,AUX!$B:$B,\"\",0,1)","v":"BLACK"},{"$f":"IF(C137=0,INDEX($C:$C,MAX(_xlfn.XLOOKUP(\"BLACK\",$C$7:C137,$A$7:A137,\"\",0,-1),_xlfn.XLOOKUP(\"RED\",$C$7:C137,$A$7:A137,\"\",0,-1)),1),C137)","v":"BLACK"},{"$f":"IF(AND(COUNTIF($D$7:D137,\"RED\")>0,COUNTIF($D$7:D137,\"BLACK\")>0),A137-MIN(_xlfn.XLOOKUP(\"BLACK\",$D$7:D137,$A$7:A137,\"\",0,-1),_xlfn.XLOOKUP(\"RED\",$D$7:D137,$A$7:A137,\"\",0,-1)),A137-6)","v":1},{"$f":"IF(AND(E136>=$E$3,L136=\"\"),\"BET\",\"\")","v":"BET"},{"$f":"IF(F137=\"BET\",IF(D136=\"RED\",\"BLACK\",IF(D136=\"BLACK\",\"RED\",\"ERROR\")),\"\")","v":"BLACK"},{"$f":"IF(F137=\"BET\",IF(D137=G137,\"SUCCESS\",\"FAIL\"),\"\")","v":"SUCCESS"},{"$f":"IF(F137=\"BET\",IF(OR(I136>=$G$4,F136=\"\"),$F$3,IF(AND(F136=\"BET\",H136=\"FAIL\"),I136*2,$F$3)),\"\")","v":5},10,290,"",{"$f":"E137*50","v":50},""]
[{"$f":"ROW()","v":138},12,{"$f":"_xlfn.XLOOKUP(B138,AUX!$A:$A,AUX!$B:$B,\"\",0,1)","v":"BLACK"},{"$f":"IF(C138=0,INDEX($C:$C,MAX(_xlfn.XLOOKUP(\"BLACK\",$C$7:C138,$A$7:A138,\"\",0,-1),_xlfn.XLOOKUP(\"RED\",$C$7:C138,$A$7:A138,\"\",0,-1)),1),C138)","v":"BLACK"},{"$f":"IF(AND(COUNTIF($D$7:D138,\"RED\")>0,COUNTIF($D$7:D138,\"BLACK\")>0),A138-MIN(_xlfn.XLOOKUP(\"BLACK\",$D$7:D138,$A$7:A138,\"\",0,-1),_xlfn.XLOOKUP(\"RED\",$D$7:D138,$A$7:A138,\"\",0,-1)),A138-6)","v":2},"BET","RED","FAIL",5,0,285,"STOP",100,""]
[{"$f":"ROW()","v":139},10,{"$f":"_xlfn.XLOOKUP(B139,AUX!$A:$A,AUX!$B:$B,\"\",0,1)","v":"BLACK"},{"$f":"IF(C139=0,INDEX($C:$C,MAX(_xlfn.XLOOKUP(\"BLACK\",$C$7:C139,$A$7:A139,\"\",0,-1),_xlfn.XLOOKUP(\"RED\",$C$7:C139,$A$7:A139,\"\",0,-1)),1),C139)","v":"BLACK"},{"$f":"IF(AND(COUNTIF($D$7:D139,\"RED\")>0,COUNTIF($D$7:D139,\"BLACK\")>0),A139-MIN(_xlfn.XLOOKUP(\"BLACK\",$D$7:D139,$A$7:A139,\"\",0,-1),_xlfn.XLOOKUP(\"RED\",$D$7:D139,$A$7:A139,\"\",0,-1)),A139-6)","v":3},"","","","","",285,"STOP",150,""]
[{"$f":"ROW()","v":140},10,{"$f":"_xlfn.XLOOKUP(B140,AUX!$A:$A,AUX!$B:$B,\"\",0,1)","v":"BLACK"},{"$f":"IF(C140=0,INDEX($C:$C,MAX(_xlfn.XLOOKUP(\"BLACK\",$C$7:C140,$A$7:A140,\"\",0,-1),_xlfn.XLOOKUP(\"RED\",$C$7:C140,$A$7:A140,\"\",0,-1)),1),C140)","v":"BLACK"},{"$f":"IF(AND(COUNTIF($D$7:D140,\"RED\")>0,COUNTIF($D$7:D140,\"BLACK\")>0),A140-MIN(_xlfn.XLOOKUP(\"BLACK\",$D$7:D140,$A$7:A140,\"\",0,-1),_xlfn.XLOOKUP(\"RED\",$D$7:D140,$A$7:A140,\"\",0,-1)),A140-6)","v":4},"","","","","",285,"STOP",200,4]
[{"$f":"ROW()","v":141},1,{"$f":"_xlfn.XLOOKUP(B141,AUX!$A:$A,AUX!$B:$B,\"\",0,1)","v":"RED"},{"$f":"IF(C141=0,INDEX($C:$C,MAX(_xlfn.XLOOKUP(\"BLACK\",$C$7:C141,$A$7:A141,\"\",0,-1),_xlfn.XLOOKUP(\"RED\",$C$7:C141,$A$7:A141,\"\",0,-1)),1),C141)","v":"RED"},{"$f":"IF(AND(COUNTIF($D$7:D141,\"RED\")>0,COUNTIF($D$7:D141,\"BLACK\")>0),A141-MIN(_xlfn.XLOOKUP(\"BLACK\",$D$7:D141,$A$7:A141,\"\",0,-1),_xlfn.XLOOKUP(\"RED\",$D$7:D141,$A$7:A141,\"\",0,-1)),A141-6)","v":1},"","","","","",285,"",50,""]
[{"$f":"ROW()","v":142},0,{"$f":"_xlfn.XLOOKUP(B142,AUX!$A:$A,AUX!$B:$B,\"\",0,1)","v":0},{"$f":"IF(C142=0,INDEX($C:$C,MAX(_xlfn.XLOOKUP(\"BLACK\",$C$7:C142,$A$7:A142,\"\",0,-1),_xlfn.XLOOKUP(\"RED\",$C$7:C142,$A$7:A142,\"\",0,-1)),1),C142)","v":"RED"},{"$f":"IF(AND(COUNTIF($D$7:D142,\"RED\")>0,COUNTIF($D$7:D142,\"BLACK\")>0),A142-MIN(_xlfn.XLOOKUP(\"BLACK\",$D$7:D142,$A$7:A142,\"\",0,-1),_xlfn.XLOOKUP(\"RED\",$D$7:D142,$A$7:A142,\"\",0,-1)),A142-6)","v":2},"BET","BLACK","FAIL",5,0,280,"STOP",100,""]
[{"$f":"ROW()","v":143},19,{"$f":"_xlfn.XLOOKUP(B143,AUX!$A:$A,AUX!$B:$B,\"\",0,1)","v":"RED"},{"$f":"IF(C143=0,INDEX($C:$C,MAX(_xlfn.XLOOKUP(\"BLACK\",$C$7:C143,$A$7:A143,\"\",0,-1),_xlfn.XLOOKUP(\"RED\",$C$7:C143,$A$7:A143,\"\",0,-1)),1),C143)","v":"RED"},{"$f":"IF(AND(COUNTIF($D$7:D143,\"RED\")>0,COUNTIF($D$7:D143,\"BLACK\")>0),A143-MIN(_xlfn.XLOOKUP(\"BLACK\",$D$7:D143,$A$7:A143,\"\",0,-1),_xlfn.XLOOKUP(\"RED\",$D$7:D143,$A$7:A143,\"\",0,-1)),A143-6)","v":3},"","","","","",280,"STOP",150,""]
[{"$f":"ROW()","v":144},19,{"$f":"_xlfn.XLOOKUP(B144,AUX!$A:$A,AUX!$B:$B,\"\",0,1)","v":"RED"},{"$f":"IF(C144=0,INDEX($C:$C,MAX(_xlfn.XLOOKUP(\"BLACK\",$C$7:C144,$A$7:A144,\"\",0,-1),_xlfn.XLOOKUP(\"RED\",$C$7:C144,$A$7:A144,\"\",0,-1)),1),C144)","v":"RED"},{"$f":"IF(AND(COUNTIF($D$7:D144,\"RED\")>0,COUNTIF($D$7:D144,\"BLACK\")>0),A144-MIN(_xlfn.XLOOKUP(\"BLACK\",$D$7:D144,$A$7:A144,\"\",0,-1),_xlfn.XLOOKUP(\"RED\",$D$7:D144,$A$7:A144,\"\",0,-1)),A144-6)","v":4},"","","","","",280,"STOP",200,""]
[{"$f":"ROW()","v":145},0,{"$f":"_xlfn.XLOOKUP(B145,AUX!$A:$A,AUX!$B:$B,\"\",0,1)","v":0},{"$f":"IF(C145=0,INDEX($C:$C,MAX(_xlfn.XLOOKUP(\"BLACK\",$C$7:C145,$A$7:A145,\"\",0,-1),_xlfn.XLOOKUP(\"RED\",$C$7:C145,$A$7:A145,\"\",0,-1)),1),C145)","v":"RED"},{"$f":"IF(AND(COUNTIF($D$7:D145,\"RED\")>0,COUNTIF($D$7:D145,\"BLACK\")>0),A145-MIN(_xlfn.XLOOKUP(\"BLACK\",$D$7:D145,$A$7:A145,\"\",0,-1),_xlfn.XLOOKUP(\"RED\",$D$7:D145,$A$7:A145,\"\",0,-1)),A145-6)","v":5},"","","","","",280,"STOP",250,5]
[{"$f":"ROW()","v":146},32,{"$f":"_xlfn.XLOOKUP(B146,AUX!$A:$A,AUX!$B:$B,\"\",0,1)","v":"BLACK"},{"$f":"IF(C146=0,INDEX($C:$C,MAX(_xlfn.XLOOKUP(\"BLACK\",$C$7:C146,$A$7:A146,\"\",0,-1),_xlfn.XLOOKUP(\"RED\",$C$7:C146,$A$7:A146,\"\",0,-1)),1),C146)","v":"BLACK"},{"$f":"IF(AND(COUNTIF($D$7:D146,\"RED\")>0,COUNTIF($D$7:D146,\"BLACK\")>0),A146-MIN(_xlfn.XLOOKUP(\"BLACK\",$D$7:D146,$A$7:A146,\"\",0,-1),_xlfn.XLOOKUP(\"RED\",$D$7:D146,$A$7:A146,\"\",0,-1)),A146-6)","v":1},"","","","","",280,"",50,1]
[{"$f":"ROW()","v":147},3,{"$f":"_xlfn.XLOOKUP(B147,AUX!$A:$A,AUX!$B:$B,\"\",0,1)","v":"RED"},{"$f":"IF(C147=0,INDEX($C:$C,MAX(_xlfn.XLOOKUP(\"BLACK\",$C$7:C147,$A$7:A147,\"\",0,-1),_xlfn.XLOOKUP(\"RED\",$C$7:C147,$A$7:A147,\"\",0,-1)),1),C147)","v":"RED"},{"$f":"IF(AND(COUNTIF($D$7:D147,\"RED\")>0,COUNTIF($D$7:D147,\"BLACK\")>0),A147-MIN(_xlfn.XLOOKUP(\"BLACK\",$D$7:D147,$A$7:A147,\"\",0,-1),_xlfn.XLOOKUP(\"RED\",$D$7:D147,$A$7:A147,\"\",0,-1)),A147-6)","v":1},"BET","RED","SUCCESS",5,10,285,"",50,1]
[{"$f":"ROW()","v":148},10,{"$f":"_xlfn.XLOOKUP(B148,AUX!$A:$A,AUX!$B:$B,\"\",0,1)","v":"BLACK"},{"$f":"IF(C148=0,INDEX($C:$C,MAX(_xlfn.XLOOKUP(\"BLACK\",$C$7:C148,$A$7:A148,\"\",0,-1),_xlfn.XLOOKUP(\"RED\",$C$7:C148,$A$7:A148,\"\",0,-1)),1),C148)","v":"BLACK"},{"$f":"IF(AND(COUNTIF($D$7:D148,\"RED\")>0,COUNTIF($D$7:D148,\"BLACK\")>0),A148-MIN(_xlfn.XLOOKUP(\"BLACK\",$D$7:D148,$A$7:A148,\"\",0,-1),_xlfn.XLOOKUP(\"RED\",$D$7:D148,$A$7:A148,\"\",0,-1)),A148-6)","v":1},"BET","BLACK","SUCCESS",5,10,290,"",50,""]
[{"$f":"ROW()","v":149},10,{"$f":"_xlfn.XLOOKUP(B149,AUX!$A:$A,AUX!$B:$B,\"\",0,1)","v":"BLACK"},{"$f":"IF(C149=0,INDEX($C:$C,MAX(_xlfn.XLOOKUP(\"BLACK\",$C$7:C149,$A$7:A149,\"\",0,-1),_xlfn.XLOOKUP(\"RED\",$C$7:C149,$A$7:A149,\"\",0,-1)),1),C149)","v":"BLACK"},{"$f":"IF(AND(COUNTIF($D$7:D149,\"RED\")>0,COUNTIF($D$7:D149,\"BLACK\")>0),A149-MIN(_xlfn.XLOOKUP(\"BLACK\",$D$7:D149,$A$7:A149,\"\",0,-1),_xlfn.XLOOKUP(\"RED\",$D$7:D149,$A$7:A149,\"\",0,-1)),A149-6)","v":2},"BET","RED","FAIL",5,0,285,"STOP",100,""]
[{"$f":"ROW()","v":150},10,{"$f":"_xlfn.XLOOKUP(B150,AUX!$A:$A,AUX!$B:$B,\"\",0,1)","v":"BLACK"},{"$f":"IF(C150=0,INDEX($C:$C,MAX(_xlfn.XLOOKUP(\"BLACK\",$C$7:C150,$A$7:A150,\"\",0,-1),_xlfn.XLOOKUP(\"RED\",$C$7:C150,$A$7:A150,\"\",0,-1)),1),C150)","v":"BLACK"},{"$f":"IF(AND(COUNTIF($D$7:D150,\"RED\")>0,COUNTIF($D$7:D150,\"BLACK\")>0),A150-MIN(_xlfn.XLOOKUP(\"BLACK\",$D$7:D150,$A$7:A150,\"\",0,-1),_xlfn.XLOOKUP(\"RED\",$D$7:D150,$A$7:A150,\"\",0,-1)),A150-6)","v":3},"","","","","",285,"STOP",150,""]
[{"$f":"ROW()","v":151},18,{"$f":"_xlfn.XLOOKUP(B151,AUX!$A:$A,AUX!$B:$B,\"\",0,1)","v":"BLACK"},{"$f":"IF(C151=0,INDEX($C:$C,MAX(_xlfn.XLOOKUP(\"BLACK\",$C$7:C151,$A$7:A151,\"\",0,-1),_xlfn.XLOOKUP(\"RED\",$C$7:C151,$A$7:A151,\"\",0,-1)),1),C151)","v":"BLACK"},{"$f":"IF(AND(COUNTIF($D$7:D151,\"RED\")>0,COUNTIF($D$7:D151,\"BLACK\")>0),A151-MIN(_xlfn.XLOOKUP(\"BLACK\",$D$7:D151,$A$7:A151,\"\",0,-1),_xlfn.XLOOKUP(\"RED\",$D$7:D151,$A$7:A151,\"\",0,-1)),A151-6)","v":4},{"$f":"IF(AND(E150>=$E$3,L150=\"\"),\"BET\",\"\")","v":""},{"$f":"IF(F151=\"BET\",IF(D150=\"RED\",\"BLACK\",IF(D150=\"BLACK\",\"RED\",\"ERROR\")),\"\")","v":""},{"$f":"IF(F151=\"BET\",IF(D151=G151,\"SUCCESS\",\"FAIL\"),\"\")","v":""},{"$f":"IF(F151=\"BET\",IF(OR(I150>=$G$4,F150=\"\"),$F$3,IF(AND(F150=\"BET\",H150=\"FAIL\"),I150*2,$F$3)),\"\")","v":""},{"$f":"IF(F151=\"BET\",IF(H151=\"SUCCESS\",I151*2,0),\"\")","v":""},{"$f":"IF(F151=\"BET\",K150-I151+J151,K150)","v":285},"STOP",{"$f":"E151*50","v":200},4]
[{"$f":"ROW()","v":152},17,{"$f":"_xlfn.XLOOKUP(B152,AUX!$A:$A,AUX!$B:$B,\"\",0,1)","v":"RED"},{"$f":"IF(C152=0,INDEX($C:$C,MAX(_xlfn.XLOOKUP(\"BLACK\",$C$7:C152,$A$7:A152,\"\",0,-1),_xlfn.XLOOKUP(\"RED\",$C$7:C152,$A$7:A152,\"\",0,-1)),1),C152)","v":"RED"},{"$f":"IF(AND(COUNTIF($D$7:D152,\"RED\")>0,COUNTIF($D$7:D152,\"BLACK\")>0),A152-MIN(_xlfn.XLOOKUP(\"BLACK\",$D$7:D152,$A$7:A152,\"\",0,-1),_xlfn.XLOOKUP(\"RED\",$D$7:D152,$A$7:A152,\"\",0,-1)),A152-6)","v":1},"","","","","",285,"",50,1]
[{"$f":"ROW()","v":153},24,{"$f":"_xlfn.XLOOKUP(B153,AUX!$A:$A,AUX!$B:$B,\"\",0,1)","v":"BLACK"},{"$f":"IF(C153=0,INDEX($C:$C,MAX(_xlfn.XLOOKUP(\"BLACK\",$C$7:C153,$A$7:A153,\"\",0,-1),_xlfn.XLOOKUP(\"RED\",$C$7:C153,$A$7:A153,\"\",0,-1)),1),C153)","v":"BLACK"},{"$f":"IF(AND(COUNTIF($D$7:D153,\"RED\")>0,COUNTIF($D$7:D153,\"BLACK\")>0),A153-MIN(_xlfn.XLOOKUP(\"BLACK\",$D$7:D153,$A$7:A153,\"\",0,-1),_xlfn.XLOOKUP(\"RED\",$D$7:D153,$A$7:A153,\"\",0,-1)),A153-6)","v":1},"BET","BLACK","SUCCESS",5,10,290,"",50,""]
[{"$f":"ROW()","v":154},26,{"$f":"_xlfn.XLOOKUP(B154,AUX!$A:$A,AUX!$B:$B,\"\",0,1)","v":"BLACK"},{"$f":"IF(C154=0,INDEX($C:$C,MAX(_xlfn.XLOOKUP(\"BLACK\",$C$7:C154,$A$7:A154,\"\",0,-1),_xlfn.XLOOKUP(\"RED\",$C$7:C154,$A$7:A154,\"\",0,-1)),1),C154)","v":"BLACK"},{"$f":"IF(AND(COUNTIF($D$7:D154,\"RED\")>0,COUNTIF($D$7:D154,\"BLACK\")>0),A154-MIN(_xlfn.XLOOKUP(\"BLACK\",$D$7:D154,$A$7:A154,\"\",0,-1),_xlfn.XLOOKUP(\"RED\",$D$7:D154,$A$7:A154,\"\",0,-1)),A154-6)","v":2},"BET","RED","FAIL",5,0,285,"STOP",100,""]
[{"$f":"ROW()","v":155},10,{"$f":"_xlfn.XLOOKUP(B155,AUX!$A:$A,AUX!$B:$B,\"\",0,1)","v":"BLACK"},{"$f":"IF(C155=0,INDEX($C:$C,MAX(_xlfn.XLOOKUP(\"BLACK\",$C$7:C155,$A$7:A155,\"\",0,-1),_xlfn.XLOOKUP(\"RED\",$C$7:C155,$A$7:A155,\"\",0,-1)),1),C155)","v":"BLACK"},{"$f":"IF(AND(COUNTIF($D$7:D155,\"RED\")>0,COUNTIF($D$7:D155,\"BLACK\")>0),A155-MIN(_xlfn.XLOOKUP(\"BLACK\",$D$7:D155,$A$7:A155,\"\",0,-1),_xlfn.XLOOKUP(\"RED\",$D$7:D155,$A$7:A155,\"\",0,-1)),A155-6)","v":3},"","","","","",285,"STOP",150,3]
[{"$f":"ROW()","v":156},19,{"$f":"_xlfn.XLOOKUP(B156,AUX!$A:$A,AUX!$B:$B,\"\",0,1)","v":"RED"},{"$f":"IF(C156=0,INDEX($C:$C,MAX(_xlfn.XLOOKUP(\"BLACK\",$C$7:C156,$A$7:A156,\"\",0,-1),_xlfn.XLOOKUP(\"RED\",$C$7:C156,$A$7:A156,\"\",0,-1)),1),C156)","v":"RED"},{"$f":"IF(AND(COUNTIF($D$7:D156,\"RED\")>0,COUNTIF($D$7:D156,\"BLACK\")>0),A156-MIN(_xlfn.XLOOKUP(\"BLACK\",$D$7:D156,$A$7:A156,\"\",0,-1),_xlfn.XLOOKUP(\"RED\",$D$7:D156,$A$7:A156,\"\",0,-1)),A156-6)","v":1},"","","","","",285,"",50,""]
[{"$f":"ROW()","v":157},19,{"$f":"_xlfn.XLOOKUP(B157,AUX!$A:$A,AUX!$B:$B,\"\",0,1)","v":"RED"},{"$f":"IF(C157=0,INDEX($C:$C,MAX(_xlfn.XLOOKUP(\"BLACK\",$C$7:C157,$A$7:A157,\"\",0,-1),_xlfn.XLOOKUP(\"RED\",$C$7:C157,$A$7:A157,\"\",0,-1)),1),C157)","v":"RED"},{"$f":"IF(AND(COUNTIF($D$7:D157,\"RED\")>0,COUNTIF($D$7:D157,\"BLACK\")>0),A157-MIN(_xlfn.XLOOKUP(\"BLACK\",$D$7:D157,$A$7:A157,\"\",0,-1),_xlfn.XLOOKUP(\"RED\",$D$7:D157,$A$7:A157,\"\",0,-1)),A157-6)","v":2},{"$f":"IF(AND(E156>=$E$3,L156=\"\"),\"BET\",\"\")","v":"BET"},{"$f":"IF(F157=\"BET\",IF(D156=\"RED\",\"BLACK\",IF(D156=\"BLACK\",\"RED\",\"ERROR\")),\"\")","v":"BLACK"},{"$f":"IF(F157=\"BET\",IF(D157=G157,\"SUCCESS\",\"FAIL\"),\"\")","v":"FAIL"},{"$f":"IF(F157=\"BET\",IF(OR(I156>=$G$4,F156=\"\"),$F$3,IF(AND(F156=\"BET\",H156=\"FAIL\"),I156*2,$F$3)),\"\")","v":5},{"$f":"IF(F157=\"BET\",IF(H157=\"SUCCESS\",I157*2,0),\"\")","v":0},{"$f":"IF(F157=\"BET\",K156-I157+J157,K156)","v":280},"STOP",{"$f":"E157*50","v":100},2]
[{"$f":"ROW()","v":158},14,{"$f":"_xlfn.XLOOKUP(B158,AUX!$A:$A,AUX!$B:$B,\"\",0,1)","v":"BLACK"},{"$f":"IF(C158=0,INDEX($C:$C,MAX(_xlfn.XLOOKUP(\"BLACK\",$C$7:C158,$A$7:A158,\"\",0,-1),_xlfn.XLOOKUP(\"RED\",$C$7:C158,$A$7:A158,\"\",0,-1)),1),C158)","v":"BLACK"},{"$f":"IF(AND(COUNTIF($D$7:D158,\"RED\")>0,COUNTIF($D$7:D158,\"BLACK\")>0),A158-MIN(_xlfn.XLOOKUP(\"BLACK\",$D$7:D158,$A$7:A158,\"\",0,-1),_xlfn.XLOOKUP(\"RED\",$D$7:D158,$A$7:A158,\"\",0,-1)),A158-6)","v":1},"","","","","",280,"",50,1]
[{"$f":"ROW()","v":159},11,{"$f":"_xlfn.XLOOKUP(B159,AUX!$A:$A,AUX!$B:$B,\"\",0,1)","v":"RED"},{"$f":"IF(C159=0,INDEX($C:$C,MAX(_xlfn.XLOOKUP(\"BLACK\",$C$7:C159,$A$7:A159,\"\",0,-1),_xlfn.XLOOKUP(\"RED\",$C$7:C159,$A$7:A159,\"\",0,-1)),1),C159)","v":"RED"},{"$f":"IF(AND(COUNTIF($D$7:D159,\"RED\")>0,COUNTIF($D$7:D159,\"BLACK\")>0),A159-MIN(_xlfn.XLOOKUP(\"BLACK\",$D$7:D159,$A$7:A159,\"\",0,-1),_xlfn.XLOOKUP(\"RED\",$D$7:D159,$A$7:A159,\"\",0,-1)),A159-6)","v":1},"BET","RED","SUCCESS",5,10,285,"",50,""]
[{"$f":"ROW()","v":160},31,{"$f":"_xlfn.XLOOKUP(B160,AUX!$A:$A,AUX!$B:$B,\"\",0,1)","v":"RED"},{"$f":"IF(C160=0,INDEX($C:$C,MAX(_xlfn.XLOOKUP(\"BLACK\",$C$7:C160,$A$7:A160,\"\",0,-1),_xlfn.XLOOKUP(\"RED\",$C$7:C160,$A$7:A160,\"\",0,-1)),1),C160)","v":"RED"},{"$f":"IF(AND(COUNTIF($D$7:D160,\"RED\")>0,COUNTIF($D$7:D160,\"BLACK\")>0),A160-MIN(_xlfn.XLOOKUP(\"BLACK\",$D$7:D160,$A$7:A160,\"\",0,-1),_xlfn.XLOOKUP(\"RED\",$D$7:D160,$A$7:A160,\"\",0,-1)),A160-6)","v":2},"BET","BLACK","FAIL",5,0,280,"STOP",100,2]
[{"$f":"ROW()","v":161},14,{"$f":"_xlfn.XLOOKUP(B161,AUX!$A:$A,AUX!$B:$B,\"\",0,1)","v":"BLACK"},{"$f":"IF(C161=0,INDEX($C:$C,MAX(_xlfn.XLOOKUP(\"BLACK\",$C$7:C161,$A$7:A161,\"\",0,-1),_xlfn.XLOOKUP(\"RED\",$C$7:C161,$A$7:A161,\"\",0,-1)),1),C161)","v":"BLACK"},{"$f":"IF(AND(COUNTIF($D$7:D161,\"RED\")>0,COUNTIF($D$7:D161,\"BLACK\")>0),A161-MIN(_xlfn.XLOOKUP(\"BLACK\",$D$7:D161,$A$7:A161,\"\",0,-1),_xlfn.XLOOKUP(\"RED\",$D$7:D161,$A$7:A161,\"\",0,-1)),A161-6)","v":1},"","","","","",280,"",50,""]
[{"$f":"ROW()","v":162},6,{"$f":"_xlfn.XLOOKUP(B162,AUX!$A:$A,AUX!$B:$B,\"\",0,1)","v":"BLACK"},{"$f":"IF(C162=0,INDEX($C:$C,MAX(_xlfn.XLOOKUP(\"BLACK\",$C$7:C162,$A$7:A162,\"\",0,-1),_xlfn.XLOOKUP(\"RED\",$C$7:C162,$A$7:A162,\"\",0,-1)),1),C162)","v":"BLACK"},{"$f":"IF(AND(COUNTIF($D$7:D162,\"RED\")>0,COUNTIF($D$7:D162,\"BLACK\")>0),A162-MIN(_xlfn.XLOOKUP(\"BLACK\",$D$7:D162,$A$7:A162,\"\",0,-1),_xlfn.XLOOKUP(\"RED\",$D$7:D162,$A$7:A162,\"\",0,-1)),A162-6)","v":2},"BET","RED","FAIL",5,0,275,"STOP",100,2]
[{"$f":"ROW()","v":163},15,{"$f":"_xlfn.XLOOKUP(B163,AUX!$A:$A,AUX!$B:$B,\"\",0,1)","v":"RED"},{"$f":"IF(C163=0,INDEX($C:$C,MAX(_xlfn.XLOOKUP(\"BLACK\",$C$7:C163,$A$7:A163,\"\",0,-1),_xlfn.XLOOKUP(\"RED\",$C$7:C163,$A$7:A163,\"\",0,-1)),1),C163)","v":"RED"},{"$f":"IF(AND(COUNTIF($D$7:D163,\"RED\")>0,COUNTIF($D$7:D163,\"BLACK\")>0),A163-MIN(_xlfn.XLOOKUP(\"BLACK\",$D$7:D163,$A$7:A163,\"\",0,-1),_xlfn.XLOOKUP(\"RED\",$D$7:D163,$A$7:A163,\"\",0,-1)),A163-6)","v":1},"","","","","",275,"",50,1]
[{"$f":"ROW()","v":164},18,{"$f":"_xlfn.XLOOKUP(B164,AUX!$A:$A,AUX!$B:$B,\"\",0,1)","v":"BLACK"},{"$f":"IF(C164=0,INDEX($C:$C,MAX(_xlfn.XLOOKUP(\"BLACK\",$C$7:C164,$A$7:A164,\"\",0,-1),_xlfn.XLOOKUP(\"RED\",$C$7:C164,$A$7:A164,\"\",0,-1)),1),C164)","v":"BLACK"},{"$f":"IF(AND(COUNTIF($D$7:D164,\"RED\")>0,COUNTIF($D$7:D164,\"BLACK\")>0),A164-MIN(_xlfn.XLOOKUP(\"BLACK\",$D$7:D164,$A$7:A164,\"\",0,-1),_xlfn.XLOOKUP(\"RED\",$D$7:D164,$A$7:A164,\"\",0,-1)),A164-6)","v":1},"BET","BLACK","SUCCESS",5,10,280,"",50,""]
[{"$f":"ROW()","v":165},8,{"$f":"_xlfn.XLOOKUP(B165,AUX!$A:$A,AUX!$B:$B,\"\",0,1)","v":"BLACK"},{"$f":"IF(C165=0,INDEX($C:$C,MAX(_xlfn.XLOOKUP(\"BLACK\",$C$7:C165,$A$7:A165,\"\",0,-1),_xlfn.XLOOKUP(\"RED\",$C$7:C165,$A$7:A165,\"\",0,-1)),1),C165)","v":"BLACK"},{"$f":"IF(AND(COUNTIF($D$7:D165,\"RED\")>0,COUNTIF($D$7:D165,\"BLACK\")>0),A165-MIN(_xlfn.XLOOKUP(\"BLACK\",$D$7:D165,$A$7:A165,\"\",0,-1),_xlfn.XLOOKUP(\"RED\",$D$7:D165,$A$7:A165,\"\",0,-1)),A165-6)","v":2},"BET","RED","FAIL",5,0,275,"STOP",100,2]
[{"$f":"ROW()","v":166},9,{"$f":"_xlfn.XLOOKUP(B166,AUX!$A:$A,AUX!$B:$B,\"\",0,1)","v":"RED"},{"$f":"IF(C166=0,INDEX($C:$C,MAX(_xlfn.XLOOKUP(\"BLACK\",$C$7:C166,$A$7:A166,\"\",0,-1),_xlfn.XLOOKUP(\"RED\",$C$7:C166,$A$7:A166,\"\",0,-1)),1),C166)","v":"RED"},{"$f":"IF(AND(COUNTIF($D$7:D166,\"RED\")>0,COUNTIF($D$7:D166,\"BLACK\")>0),A166-MIN(_xlfn.XLOOKUP(\"BLACK\",$D$7:D166,$A$7:A166,\"\",0,-1),_xlfn.XLOOKUP(\"RED\",$D$7:D166,$A$7:A166,\"\",0,-1)),A166-6)","v":1},"","","","","",275,"",50,""]
[{"$f":"ROW()","v":167},3,{"$f":"_xlfn.XLOOKUP(B167,AUX!$A:$A,AUX!$B:$B,\"\",0,1)","v":"RED"},{"$f":"IF(C167=0,INDEX($C:$C,MAX(_xlfn.XLOOKUP(\"BLACK\",$C$7:C167,$A$7:A167,\"\",0,-1),_xlfn.XLOOKUP(\"RED\",$C$7:C167,$A$7:A167,\"\",0,-1)),1),C167)","v":"RED"},{"$f":"IF(AND(COUNTIF($D$7:D167,\"RED\")>0,COUNTIF($D$7:D167,\"BLACK\")>0),A167-MIN(_xlfn.XLOOKUP(\"BLACK\",$D$7:D167,$A$7:A167,\"\",0,-1),_xlfn.XLOOKUP(\"RED\",$D$7:D167,$A$7:A167,\"\",0,-1)),A167-6)","v":2},"BET","BLACK","FAIL",5,0,270,"STOP",100,""]
[{"$f":"ROW()","v":168},25,{"$f":"_xlfn.XLOOKUP(B168,AUX!$A:$A,AUX!$B:$B,\"\",0,1)","v":"RED"},{"$f":"IF(C168=0,INDEX($C:$C,MAX(_xlfn.XLOOKUP(\"BLACK\",$C$7:C168,$A$7:A168,\"\",0,-1),_xlfn.XLOOKUP(\"RED\",$C$7:C168,$A$7:A168,\"\",0,-1)),1),C168)","v":"RED"},{"$f":"IF(AND(COUNTIF($D$7:D168,\"RED\")>0,COUNTIF($D$7:D168,\"BLACK\")>0),A168-MIN(_xlfn.XLOOKUP(\"BLACK\",$D$7:D168,$A$7:A168,\"\",0,-1),_xlfn.XLOOKUP(\"RED\",$D$7:D168,$A$7:A168,\"\",0,-1)),A168-6)","v":3},"","","","","",270,"STOP",150,""]
[{"$f":"ROW()","v":169},1,{"$f":"_xlfn.XLOOKUP(B169,AUX!$A:$A,AUX!$B:$B,\"\",0,1)","v":"RED"},{"$f":"IF(C169=0,INDEX($C:$C,MAX(_xlfn.XLOOKUP(\"BLACK\",$C$7:C169,$A$7:A169,\"\",0,-1),_xlfn.XLOOKUP(\"RED\",$C$7:C169,$A$7:A169,\"\",0,-1)),1),C169)","v":"RED"},{"$f":"IF(AND(COUNTIF($D$7:D169,\"RED\")>0,COUNTIF($D$7:D169,\"BLACK\")>0),A169-MIN(_xlfn.XLOOKUP(\"BLACK\",$D$7:D169,$A$7:A169,\"\",0,-1),_xlfn.XLOOKUP(\"RED\",$D$7:D169,$A$7:A169,\"\",0,-1)),A169-6)","v":4},"","","","","",270,"STOP",200,""]
[{"$f":"ROW()","v":170},31,{"$f":"_xlfn.XLOOKUP(B170,AUX!$A:$A,AUX!$B:$B,\"\",0,1)","v":"RED"},{"$f":"IF(C170=0,INDEX($C:$C,MAX(_xlfn.XLOOKUP(\"BLACK\",$C$7:C170,$A$7:A170,\"\",0,-1),_xlfn.XLOOKUP(\"RED\",$C$7:C170,$A$7:A170,\"\",0,-1)),1),C170)","v":"RED"},{"$f":"IF(AND(COUNTIF($D$7:D170,\"RED\")>0,COUNTIF($D$7:D170,\"BLACK\")>0),A170-MIN(_xlfn.XLOOKUP(\"BLACK\",$D$7:D170,$A$7:A170,\"\",0,-1),_xlfn.XLOOKUP(\"RED\",$D$7:D170,$A$7:A170,\"\",0,-1)),A170-6)","v":5},"","","","","",270,"STOP",250,5]
[{"$f":"ROW()","v":171},10,{"$f":"_xlfn.XLOOKUP(B171,AUX!$A:$A,AUX!$B:$B,\"\",0,1)","v":"BLACK"},{"$f":"IF(C171=0,INDEX($C:$C,MAX(_xlfn.XLOOKUP(\"BLACK\",$C$7:C171,$A$7:A171,\"\",0,-1),_xlfn.XLOOKUP(\"RED\",$C$7:C171,$A$7:A171,\"\",0,-1)),1),C171)","v":"BLACK"},{"$f":"IF(AND(COUNTIF($D$7:D171,\"RED\")>0,COUNTIF($D$7:D171,\"BLACK\")>0),A171-MIN(_xlfn.XLOOKUP(\"BLACK\",$D$7:D171,$A$7:A171,\"\",0,-1),_xlfn.XLOOKUP(\"RED\",$D$7:D171,$A$7:A171,\"\",0,-1)),A171-6)","v":1},"","","","","",270,"",50,1]
[{"$f":"ROW()","v":172},5,{"$f":"_xlfn.XLOOKUP(B172,AUX!$A:$A,AUX!$B:$B,\"\",0,1)","v":"RED"},{"$f":"IF(C172=0,INDEX($C:$C,MAX(_xlfn.XLOOKUP(\"BLACK\",$C$7:C172,$A$7:A172,\"\",0,-1),_xlfn.XLOOKUP(\"RED\",$C$7:C172,$A$7:A172,\"\",0,-1)),1),C172)","v":"RED"},{"$f":"IF(AND(COUNTIF($D$7:D172,\"RED\")>0,COUNTIF($D$7:D172,\"BLACK\")>0),A172-MIN(_xlfn.XLOOKUP(\"BLACK\",$D$7:D172,$A$7:A172,\"\",0,-1),_xlfn.XLOOKUP(\"RED\",$D$7:D172,$A$7:A172,\"\",0,-1)),A172-6)","v":1},"BET","RED","SUCCESS",5,10,275,"",50,1]
[{"$f":"ROW()","v":173},34,{"$f":"_xlfn.XLOOKUP(B173,AUX!$A:$A,AUX!$B:$B,\"\",0,1)","v":"BLACK"},{"$f":"IF(C173=0,INDEX($C:$C,MAX(_xlfn.XLOOKUP(\"BLACK\",$C$7:C173,$A$7:A173,\"\",0,-1),_xlfn.XLOOKUP(\"RED\",$C$7:C173,$A$7:A173,\"\",0,-1)),1),C173)","v":"BLACK"},{"$f":"IF(AND(COUNTIF($D$7:D173,\"RED\")>0,COUNTIF($D$7:D173,\"BLACK\")>0),A173-MIN(_xlfn.XLOOKUP(\"BLACK\",$D$7:D173,$A$7:A173,\"\",0,-1),_xlfn.XLOOKUP(\"RED\",$D$7:D173,$A$7:A173,\"\",0,-1)),A173-6)","v":1},"BET","BLACK","SUCCESS",5,10,280,"",50,1]
[{"$f":"ROW()","v":174},35,{"$f":"_xlfn.XLOOKUP(B174,AUX!$A:$A,AUX!$B:$B,\"\",0,1)","v":"RED"},{"$f":"IF(C174=0,INDEX($C:$C,MAX(_xlfn.XLOOKUP(\"BLACK\",$C$7:C174,$A$7:A174,\"\",0,-1),_xlfn.XLOOKUP(\"RED\",$C$7:C174,$A$7:A174,\"\",0,-1)),1),C174)","v":"RED"},{"$f":"IF(AND(COUNTIF($D$7:D174,\"RED\")>0,COUNTIF($D$7:D174,\"BLACK\")>0),A174-MIN(_xlfn.XLOOKUP(\"BLACK\",$D$7:D174,$A$7:A174,\"\",0,-1),_xlfn.XLOOKUP(\"RED\",$D$7:D174,$A$7:A174,\"\",0,-1)),A174-6)","v":1},"BET","RED","SUCCESS",5,10,285,"",50,""]
[{"$f":"ROW()","v":175},25,{"$f":"_xlfn.XLOOKUP(B175,AUX!$A:$A,AUX!$B:$B,\"\",0,1)","v":"RED"},{"$f":"IF(C175=0,INDEX($C:$C,MAX(_xlfn.XLOOKUP(\"BLACK\",$C$7:C175,$A$7:A175,\"\",0,-1),_xlfn.XLOOKUP(\"RED\",$C$7:C175,$A$7:A175,\"\",0,-1)),1),C175)","v":"RED"},{"$f":"IF(AND(COUNTIF($D$7:D175,\"RED\")>0,COUNTIF($D$7:D175,\"BLACK\")>0),A175-MIN(_xlfn.XLOOKUP(\"BLACK\",$D$7:D175,$A$7:A175,\"\",0,-1),_xlfn.XLOOKUP(\"RED\",$D$7:D175,$A$7:A175,\"\",0,-1)),A175-6)","v":2},"BET","BLACK","FAIL",5,0,280,"STOP",100,""]
[{"$f":"ROW()","v":176},19,{"$f":"_xlfn.XLOOKUP(B176,AUX!$A:$A,AUX!$B:$B,\"\",0,1)","v":"RED"},{"$f":"IF(C176=0,INDEX($C:$C,MAX(_xlfn.XLOOKUP(\"BLACK\",$C$7:C176,$A$7:A176,\"\",0,-1),_xlfn.XLOOKUP(\"RED\",$C$7:C176,$A$7:A176,\"\",0,-1)),1),C176)","v":"RED"},{"$f":"IF(AND(COUNTIF($D$7:D176,\"RED\")>0,COUNTIF($D$7:D176,\"BLACK\")>0),A176-MIN(_xlfn.XLOOKUP(\"BLACK\",$D$7:D176,$A$7:A176,\"\",0,-1),_xlfn.XLOOKUP(\"RED\",$D$7:D176,$A$7:A176,\"\",0,-1)),A176-6)","v":3},"","","","","",280,"STOP",150,""]
[{"$f":"ROW()","v":177},33,{"$f":"_xlfn.XLOOKUP(B177,AUX!$A:$A,AUX!$B:$B,\"\",0,1)","v":"RED"},{"$f":"IF(C177=0,INDEX($C:$C,MAX(_xlfn.XLOOKUP(\"BLACK\",$C$7:C177,$A$7:A177,\"\",0,-1),_xlfn.XLOOKUP(\"RED\",$C$7:C177,$A$7:A177,\"\",0,-1)),1),C177)","v":"RED"},{"$f":"IF(AND(COUNTIF($D$7:D177,\"RED\")>0,COUNTIF($D$7:D177,\"BLACK\")>0),A177-MIN(_xlfn.XLOOKUP(\"BLACK\",$D$7:D177,$A$7:A177,\"\",0,-1),_xlfn.XLOOKUP(\"RED\",$D$7:D177,$A$7:A177,\"\",0,-1)),A177-6)","v":4},"","","","","",280,"STOP",200,4]
[{"$f":"ROW()","v":178},16,{"$f":"_xlfn.XLOOKUP(B178,AUX!$A:$A,AUX!$B:$B,\"\",0,1)","v":"BLACK"},{"$f":"IF(C178=0,INDEX($C:$C,MAX(_xlfn.XLOOKUP(\"BLACK\",$C$7:C178,$A$7:A178,\"\",0,-1),_xlfn.XLOOKUP(\"RED\",$C$7:C178,$A$7:A178,\"\",0,-1)),1),C178)","v":"BLACK"},{"$f":"IF(AND(COUNTIF($D$7:D178,\"RED\")>0,COUNTIF($D$7:D178,\"BLACK\")>0),A178-MIN(_xlfn.XLOOKUP(\"BLACK\",$D$7:D178,$A$7:A178,\"\",0,-1),_xlfn.XLOOKUP(\"RED\",$D$7:D178,$A$7:A178,\"\",0,-1)),A178-6)","v":1},"","","","","",280,"",50,1]
[{"$f":"ROW()","v":179},11,{"$f":"_xlfn.XLOOKUP(B179,AUX!$A:$A,AUX!$B:$B,\"\",0,1)","v":"RED"},{"$f":"IF(C179=0,INDEX($C:$C,MAX(_xlfn.XLOOKUP(\"BLACK\",$C$7:C179,$A$7:A179,\"\",0,-1),_xlfn.XLOOKUP(\"RED\",$C$7:C179,$A$7:A179,\"\",0,-1)),1),C179)","v":"RED"},{"$f":"IF(AND(COUNTIF($D$7:D179,\"RED\")>0,COUNTIF($D$7:D179,\"BLACK\")>0),A179-MIN(_xlfn.XLOOKUP(\"BLACK\",$D$7:D179,$A$7:A179,\"\",0,-1),_xlfn.XLOOKUP(\"RED\",$D$7:D179,$A$7:A179,\"\",0,-1)),A179-6)","v":1},"BET","RED","SUCCESS",5,10,285,"",50,1]
[{"$f":"ROW()","v":180},20,{"$f":"_xlfn.XLOOKUP(B180,AUX!$A:$A,AUX!$B:$B,\"\",0,1)","v":"BLACK"},{"$f":"IF(C180=0,INDEX($C:$C,MAX(_xlfn.XLOOKUP(\"BLACK\",$C$7:C180,$A$7:A180,\"\",0,-1),_xlfn.XLOOKUP(\"RED\",$C$7:C180,$A$7:A180,\"\",0,-1)),1),C180)","v":"BLACK"},{"$f":"IF(AND(COUNTIF($D$7:D180,\"RED\")>0,COUNTIF($D$7:D180,\"BLACK\")>0),A180-MIN(_xlfn.XLOOKUP(\"BLACK\",$D$7:D180,$A$7:A180,\"\",0,-1),_xlfn.XLOOKUP(\"RED\",$D$7:D180,$A$7:A180,\"\",0,-1)),A180-6)","v":1},"BET","BLACK","SUCCESS",5,10,290,"",50,""]
[{"$f":"ROW()","v":181},24,{"$f":"_xlfn.XLOOKUP(B181,AUX!$A:$A,AUX!$B:$B,\"\",0,1)","v":"BLACK"},{"$f":"IF(C181=0,INDEX($C:$C,MAX(_xlfn.XLOOKUP(\"BLACK\",$C$7:C181,$A$7:A181,\"\",0,-1),_xlfn.XLOOKUP(\"RED\",$C$7:C181,$A$7:A181,\"\",0,-1)),1),C181)","v":"BLACK"},{"$f":"IF(AND(COUNTIF($D$7:D181,\"RED\")>0,COUNTIF($D$7:D181,\"BLACK\")>0),A181-MIN(_xlfn.XLOOKUP(\"BLACK\",$D$7:D181,$A$7:A181,\"\",0,-1),_xlfn.XLOOKUP(\"RED\",$D$7:D181,$A$7:A181,\"\",0,-1)),A181-6)","v":2},"BET","RED","FAIL",5,0,285,"STOP",100,""]
[{"$f":"ROW()","v":182},12,{"$f":"_xlfn.XLOOKUP(B182,AUX!$A:$A,AUX!$B:$B,\"\",0,1)","v":"BLACK"},{"$f":"IF(C182=0,INDEX($C:$C,MAX(_xlfn.XLOOKUP(\"BLACK\",$C$7:C182,$A$7:A182,\"\",0,-1),_xlfn.XLOOKUP(\"RED\",$C$7:C182,$A$7:A182,\"\",0,-1)),1),C182)","v":"BLACK"},{"$f":"IF(AND(COUNTIF($D$7:D182,\"RED\")>0,COUNTIF($D$7:D182,\"BLACK\")>0),A182-MIN(_xlfn.XLOOKUP(\"BLACK\",$D$7:D182,$A$7:A182,\"\",0,-1),_xlfn.XLOOKUP(\"RED\",$D$7:D182,$A$7:A182,\"\",0,-1)),A182-6)","v":3},"","","","","",285,"STOP",150,3]
[{"$f":"ROW()","v":183},31,{"$f":"_xlfn.XLOOKUP(B183,AUX!$A:$A,AUX!$B:$B,\"\",0,1)","v":"RED"},{"$f":"IF(C183=0,INDEX($C:$C,MAX(_xlfn.XLOOKUP(\"BLACK\",$C$7:C183,$A$7:A183,\"\",0,-1),_xlfn.XLOOKUP(\"RED\",$C$7:C183,$A$7:A183,\"\",0,-1)),1),C183)","v":"RED"},{"$f":"IF(AND(COUNTIF($D$7:D183,\"RED\")>0,COUNTIF($D$7:D183,\"BLACK\")>0),A183-MIN(_xlfn.XLOOKUP(\"BLACK\",$D$7:D183,$A$7:A183,\"\",0,-1),_xlfn.XLOOKUP(\"RED\",$D$7:D183,$A$7:A183,\"\",0,-1)),A183-6)","v":1},"","","","","",285,"",50,1]
[{"$f":"ROW()","v":184},20,{"$f":"_xlfn.XLOOKUP(B184,AUX!$A:$A,AUX!$B:$B,\"\",0,1)","v":"BLACK"},{"$f":"IF(C184=0,INDEX($C:$C,MAX(_xlfn.XLOOKUP(\"BLACK\",$C$7:C184,$A$7:A184,\"\",0,-1),_xlfn.XLOOKUP(\"RED\",$C$7:C184,$A$7:A184,\"\",0,-1)),1),C184)","v":"BLACK"},{"$f":"IF(AND(COUNTIF($D$7:D184,\"RED\")>0,COUNTIF($D$7:D184,\"BLACK\")>0),A184-MIN(_xlfn.XLOOKUP(\"BLACK\",$D$7:D184,$A$7:A184,\"\",0,-1),_xlfn.XLOOKUP(\"RED\",$D$7:D184,$A$7:A184,\"\",0,-1)),A184-6)","v":1},"BET","BLACK","SUCCESS",5,10,290,"",50,1]
[{"$f":"ROW()","v":185},27,{"$f":"_xlfn.XLOOKUP(B185,AUX!$A:$A,AUX!$B:$B,\"\",0,1)","v":"RED"},{"$f":"IF(C185=0,INDEX($C:$C,MAX(_xlfn.XLOOKUP(\"BLACK\",$C$7:C185,$A$7:A185,\"\",0,-1),_xlfn.XLOOKUP(\"RED\",$C$7:C185,$A$7:A185,\"\",0,-1)),1),C185)","v":"RED"},{"$f":"IF(AND(COUNTIF($D$7:D185,\"RED\")>0,COUNTIF($D$7:D185,\"BLACK\")>0),A185-MIN(_xlfn.XLOOKUP(\"BLACK\",$D$7:D185,$A$7:A185,\"\",0,-1),_xlfn.XLOOKUP(\"RED\",$D$7:D185,$A$7:A185,\"\",0,-1)),A185-6)","v":1},"BET","RED","SUCCESS",5,10,295,"",50,""]
[{"$f":"ROW()","v":186},11,{"$f":"_xlfn.XLOOKUP(B186,AUX!$A:$A,AUX!$B:$B,\"\",0,1)","v":"RED"},{"$f":"IF(C186=0,INDEX($C:$C,MAX(_xlfn.XLOOKUP(\"BLACK\",$C$7:C186,$A$7:A186,\"\",0,-1),_xlfn.XLOOKUP(\"RED\",$C$7:C186,$A$7:A186,\"\",0,-1)),1),C186)","v":"RED"},{"$f":"IF(AND(COUNTIF($D$7:D186,\"RED\")>0,COUNTIF($D$7:D186,\"BLACK\")>0),A186-MIN(_xlfn.XLOOKUP(\"BLACK\",$D$7:D186,$A$7:A186,\"\",0,-1),_xlfn.XLOOKUP(\"RED\",$D$7:D186,$A$7:A186,\"\",0,-1)),A186-6)","v":2},"BET","BLACK","FAIL",5,0,290,"STOP",100,""]
[{"$f":"ROW()","v":187},23,{"$f":"_xlfn.XLOOKUP(B187,AUX!$A:$A,AUX!$B:$B,\"\",0,1)","v":"RED"},{"$f":"IF(C187=0,INDEX($C:$C,MAX(_xlfn.XLOOKUP(\"BLACK\",$C$7:C187,$A$7:A187,\"\",0,-1),_xlfn.XLOOKUP(\"RED\",$C$7:C187,$A$7:A187,\"\",0,-1)),1),C187)","v":"RED"},{"$f":"IF(AND(COUNTIF($D$7:D187,\"RED\")>0,COUNTIF($D$7:D187,\"BLACK\")>0),A187-MIN(_xlfn.XLOOKUP(\"BLACK\",$D$7:D187,$A$7:A187,\"\",0,-1),_xlfn.XLOOKUP(\"RED\",$D$7:D187,$A$7:A187,\"\",0,-1)),A187-6)","v":3},"","","","","",290,"STOP",150,3]
[{"$f":"ROW()","v":188},26,{"$f":"_xlfn.XLOOKUP(B188,AUX!$A:$A,AUX!$B:$B,\"\",0,1)","v":"BLACK"},{"$f":"IF(C188=0,INDEX($C:$C,MAX(_xlfn.XLOOKUP(\"BLACK\",$C$7:C188,$A$7:A188,\"\",0,-1),_xlfn.XLOOKUP(\"RED\",$C$7:C188,$A$7:A188,\"\",0,-1)),1),C188)","v":"BLACK"},{"$f":"IF(AND(COUNTIF($D$7:D188,\"RED\")>0,COUNTIF($D$7:D188,\"BLACK\")>0),A188-MIN(_xlfn.XLOOKUP(\"BLACK\",$D$7:D188,$A$7:A188,\"\",0,-1),_xlfn.XLOOKUP(\"RED\",$D$7:D188,$A$7:A188,\"\",0,-1)),A188-6)","v":1},"","","","","",290,"",50,""]
[{"$f":"ROW()","v":189},26,{"$f":"_xlfn.XLOOKUP(B189,AUX!$A:$A,AUX!$B:$B,\"\",0,1)","v":"BLACK"},{"$f":"IF(C189=0,INDEX($C:$C,MAX(_xlfn.XLOOKUP(\"BLACK\",$C$7:C189,$A$7:A189,\"\",0,-1),_xlfn.XLOOKUP(\"RED\",$C$7:C189,$A$7:A189,\"\",0,-1)),1),C189)","v":"BLACK"},{"$f":"IF(AND(COUNTIF($D$7:D189,\"RED\")>0,COUNTIF($D$7:D189,\"BLACK\")>0),A189-MIN(_xlfn.XLOOKUP(\"BLACK\",$D$7:D189,$A$7:A189,\"\",0,-1),_xlfn.XLOOKUP(\"RED\",$D$7:D189,$A$7:A189,\"\",0,-1)),A189-6)","v":2},"BET","RED","FAIL",5,0,285,"STOP",100,2]
[{"$f":"ROW()","v":190},7,{"$f":"_xlfn.XLOOKUP(B190,AUX!$A:$A,AUX!$B:$B,\"\",0,1)","v":"RED"},{"$f":"IF(C190=0,INDEX($C:$C,MAX(_xlfn.XLOOKUP(\"BLACK\",$C$7:C190,$A$7:A190,\"\",0,-1),_xlfn.XLOOKUP(\"RED\",$C$7:C190,$A$7:A190,\"\",0,-1)),1),C190)","v":"RED"},{"$f":"IF(AND(COUNTIF($D$7:D190,\"RED\")>0,COUNTIF($D$7:D190,\"BLACK\")>0),A190-MIN(_xlfn.XLOOKUP(\"BLACK\",$D$7:D190,$A$7:A190,\"\",0,-1),_xlfn.XLOOKUP(\"RED\",$D$7:D190,$A$7:A190,\"\",0,-1)),A190-6)","v":1},"","","","","",285,"",50,1]
[{"$f":"ROW()","v":191},4,{"$f":"_xlfn.XLOOKUP(B191,AUX!$A:$A,AUX!$B:$B,\"\",0,1)","v":"BLACK"},{"$f":"IF(C191=0,INDEX($C:$C,MAX(_xlfn.XLOOKUP(\"BLACK\",$C$7:C191,$A$7:A191,\"\",0,-1),_xlfn.XLOOKUP(\"RED\",$C$7:C191,$A$7:A191,\"\",0,-1)),1),C191)","v":"BLACK"},{"$f":"IF(AND(COUNTIF($D$7:D191,\"RED\")>0,COUNTIF($D$7:D191,\"BLACK\")>0),A191-MIN(_xlfn.XLOOKUP(\"BLACK\",$D$7:D191,$A$7:A191,\"\",0,-1),_xlfn.XLOOKUP(\"RED\",$D$7:D191,$A$7:A191,\"\",0,-1)),A191-6)","v":1},"BET","BLACK","SUCCESS",5,10,290,"",50,1]
[{"$f":"ROW()","v":192},19,{"$f":"_xlfn.XLOOKUP(B192,AUX!$A:$A,AUX!$B:$B,\"\",0,1)","v":"RED"},{"$f":"IF(C192=0,INDEX($C:$C,MAX(_xlfn.XLOOKUP(\"BLACK\",$C$7:C192,$A$7:A192,\"\",0,-1),_xlfn.XLOOKUP(\"RED\",$C$7:C192,$A$7:A192,\"\",0,-1)),1),C192)","v":"RED"},{"$f":"IF(AND(COUNTIF($D$7:D192,\"RED\")>0,COUNTIF($D$7:D192,\"BLACK\")>0),A192-MIN(_xlfn.XLOOKUP(\"BLACK\",$D$7:D192,$A$7:A192,\"\",0,-1),_xlfn.XLOOKUP(\"RED\",$D$7:D192,$A$7:A192,\"\",0,-1)),A192-6)","v":1},"BET","RED","SUCCESS",5,10,295,"",50,1]
[{"$f":"ROW()","v":193},6,{"$f":"_xlfn.XLOOKUP(B193,AUX!$A:$A,AUX!$B:$B,\"\",0,1)","v":"BLACK"},{"$f":"IF(C193=0,INDEX($C:$C,MAX(_xlfn.XLOOKUP(\"BLACK\",$C$7:C193,$A$7:A193,\"\",0,-1),_xlfn.XLOOKUP(\"RED\",$C$7:C193,$A$7:A193,\"\",0,-1)),1),C193)","v":"BLACK"},{"$f":"IF(AND(COUNTIF($D$7:D193,\"RED\")>0,COUNTIF($D$7:D193,\"BLACK\")>0),A193-MIN(_xlfn.XLOOKUP(\"BLACK\",$D$7:D193,$A$7:A193,\"\",0,-1),_xlfn.XLOOKUP(\"RED\",$D$7:D193,$A$7:A193,\"\",0,-1)),A193-6)","v":1},"BET","BLACK","SUCCESS",5,10,300,"",50,""]
[{"$f":"ROW()","v":194},2,{"$f":"_xlfn.XLOOKUP(B194,AUX!$A:$A,AUX!$B:$B,\"\",0,1)","v":"BLACK"},{"$f":"IF(C194=0,INDEX($C:$C,MAX(_xlfn.XLOOKUP(\"BLACK\",$C$7:C194,$A$7:A194,\"\",0,-1),_xlfn.XLOOKUP(\"RED\",$C$7:C194,$A$7:A194,\"\",0,-1)),1),C194)","v":"BLACK"},{"$f":"IF(AND(COUNTIF($D$7:D194,\"RED\")>0,COUNTIF($D$7:D194,\"BLACK\")>0),A194-MIN(_xlfn.XLOOKUP(\"BLACK\",$D$7:D194,$A$7:A194,\"\",0,-1),_xlfn.XLOOKUP(\"RED\",$D$7:D194,$A$7:A194,\"\",0,-1)),A194-6)","v":2},"BET","RED","FAIL",5,0,295,"STOP",100,2]
[{"$f":"ROW()","v":195},31,{"$f":"_xlfn.XLOOKUP(B195,AUX!$A:$A,AUX!$B:$B,\"\",0,1)","v":"RED"},{"$f":"IF(C195=0,INDEX($C:$C,MAX(_xlfn.XLOOKUP(\"BLACK\",$C$7:C195,$A$7:A195,\"\",0,-1),_xlfn.XLOOKUP(\"RED\",$C$7:C195,$A$7:A195,\"\",0,-1)),1),C195)","v":"RED"},{"$f":"IF(AND(COUNTIF($D$7:D195,\"RED\")>0,COUNTIF($D$7:D195,\"BLACK\")>0),A195-MIN(_xlfn.XLOOKUP(\"BLACK\",$D$7:D195,$A$7:A195,\"\",0,-1),_xlfn.XLOOKUP(\"RED\",$D$7:D195,$A$7:A195,\"\",0,-1)),A195-6)","v":1},"","","","","",295,"",50,""]
[{"$f":"ROW()","v":196},13,{"$f":"_xlfn.XLOOKUP(B196,AUX!$A:$A,AUX!$B:$B,\"\",0,1)","v":"RED"},{"$f":"IF(C196=0,INDEX($C:$C,MAX(_xlfn.XLOOKUP(\"BLACK\",$C$7:C196,$A$7:A196,\"\",0,-1),_xlfn.XLOOKUP(\"RED\",$C$7:C196,$A$7:A196,\"\",0,-1)),1),C196)","v":"RED"},{"$f":"IF(AND(COUNTIF($D$7:D196,\"RED\")>0,COUNTIF($D$7:D196,\"BLACK\")>0),A196-MIN(_xlfn.XLOOKUP(\"BLACK\",$D$7:D196,$A$7:A196,\"\",0,-1),_xlfn.XLOOKUP(\"RED\",$D$7:D196,$A$7:A196,\"\",0,-1)),A196-6)","v":2},"BET","BLACK","FAIL",5,0,290,"STOP",100,2]
[{"$f":"ROW()","v":197},4,{"$f":"_xlfn.XLOOKUP(B197,AUX!$A:$A,AUX!$B:$B,\"\",0,1)","v":"BLACK"},{"$f":"IF(C197=0,INDEX($C:$C,MAX(_xlfn.XLOOKUP(\"BLACK\",$C$7:C197,$A$7:A197,\"\",0,-1),_xlfn.XLOOKUP(\"RED\",$C$7:C197,$A$7:A197,\"\",0,-1)),1),C197)","v":"BLACK"},{"$f":"IF(AND(COUNTIF($D$7:D197,\"RED\")>0,COUNTIF($D$7:D197,\"BLACK\")>0),A197-MIN(_xlfn.XLOOKUP(\"BLACK\",$D$7:D197,$A$7:A197,\"\",0,-1),_xlfn.XLOOKUP(\"RED\",$D$7:D197,$A$7:A197,\"\",0,-1)),A197-6)","v":1},"","","","","",290,"",50,""]
[{"$f":"ROW()","v":198},26,{"$f":"_xlfn.XLOOKUP(B198,AUX!$A:$A,AUX!$B:$B,\"\",0,1)","v":"BLACK"},{"$f":"IF(C198=0,INDEX($C:$C,MAX(_xlfn.XLOOKUP(\"BLACK\",$C$7:C198,$A$7:A198,\"\",0,-1),_xlfn.XLOOKUP(\"RED\",$C$7:C198,$A$7:A198,\"\",0,-1)),1),C198)","v":"BLACK"},{"$f":"IF(AND(COUNTIF($D$7:D198,\"RED\")>0,COUNTIF($D$7:D198,\"BLACK\")>0),A198-MIN(_xlfn.XLOOKUP(\"BLACK\",$D$7:D198,$A$7:A198,\"\",0,-1),_xlfn.XLOOKUP(\"RED\",$D$7:D198,$A$7:A198,\"\",0,-1)),A198-6)","v":2},"BET","RED","FAIL",5,0,285,"STOP",100,2]
[{"$f":"ROW()","v":199},33,{"$f":"_xlfn.XLOOKUP(B199,AUX!$A:$A,AUX!$B:$B,\"\",0,1)","v":"RED"},{"$f":"IF(C199=0,INDEX($C:$C,MAX(_xlfn.XLOOKUP(\"BLACK\",$C$7:C199,$A$7:A199,\"\",0,-1),_xlfn.XLOOKUP(\"RED\",$C$7:C199,$A$7:A199,\"\",0,-1)),1),C199)","v":"RED"},{"$f":"IF(AND(COUNTIF($D$7:D199,\"RED\")>0,COUNTIF($D$7:D199,\"BLACK\")>0),A199-MIN(_xlfn.XLOOKUP(\"BLACK\",$D$7:D199,$A$7:A199,\"\",0,-1),_xlfn.XLOOKUP(\"RED\",$D$7:D199,$A$7:A199,\"\",0,-1)),A199-6)","v":1},"","","","","",285,"",50,""]
[{"$f":"ROW()","v":200},{"$f":"RANDBETWEEN(0,36)","v":27},{"$f":"_xlfn.XLOOKUP(B200,AUX!$A:$A,AUX!$B:$B,\"\",0,1)","v":"RED"},{"$f":"IF(C200=0,INDEX($C:$C,MAX(_xlfn.XLOOKUP(\"BLACK\",$C$7:C200,$A$7:A200,\"\",0,-1),_xlfn.XLOOKUP(\"RED\",$C$7:C200,$A$7:A200,\"\",0,-1)),1),C200)","v":"RED"},{"$f":"IF(AND(COUNTIF($D$7:D200,\"RED\")>0,COUNTIF($D$7:D200,\"BLACK\")>0),A200-MIN(_xlfn.XLOOKUP(\"BLACK\",$D$7:D200,$A$7:A200,\"\",0,-1),_xlfn.XLOOKUP(\"RED\",$D$7:D200,$A$7:A200,\"\",0,-1)),A200-6)","v":2},"BET","BLACK","FAIL",5,0,280,{"$f":"IF(OR(AND(H200=\"FAIL\",I200=$G$4),AND(L199=\"STOP\",E200>$E$3)),\"STOP\",\"\")","v":"STOP"},100,{"$f":"IF(E201<=E200,E200,\"\")","v":""}]
[{"$f":"ROW()","v":201},11,{"$f":"_xlfn.XLOOKUP(B201,AUX!$A:$A,AUX!$B:$B,\"\",0,1)","v":"RED"},{"$f":"IF(C201=0,INDEX($C:$C,MAX(_xlfn.XLOOKUP(\"BLACK\",$C$7:C201,$A$7:A201,\"\",0,-1),_xlfn.XLOOKUP(\"RED\",$C$7:C201,$A$7:A201,\"\",0,-1)),1),C201)","v":"RED"},{"$f":"IF(AND(COUNTIF($D$7:D201,\"RED\")>0,COUNTIF($D$7:D201,\"BLACK\")>0),A201-MIN(_xlfn.XLOOKUP(\"BLACK\",$D$7:D201,$A$7:A201,\"\",0,-1),_xlfn.XLOOKUP(\"RED\",$D$7:D201,$A$7:A201,\"\",0,-1)),A201-6)","v":3},"","","","","",280,"STOP",150,3]
[{"$f":"ROW()","v":202},12,{"$f":"_xlfn.XLOOKUP(B202,AUX!$A:$A,AUX!$B:$B,\"\",0,1)","v":"BLACK"},{"$f":"IF(C202=0,INDEX($C:$C,MAX(_xlfn.XLOOKUP(\"BLACK\",$C$7:C202,$A$7:A202,\"\",0,-1),_xlfn.XLOOKUP(\"RED\",$C$7:C202,$A$7:A202,\"\",0,-1)),1),C202)","v":"BLACK"},{"$f":"IF(AND(COUNTIF($D$7:D202,\"RED\")>0,COUNTIF($D$7:D202,\"BLACK\")>0),A202-MIN(_xlfn.XLOOKUP(\"BLACK\",$D$7:D202,$A$7:A202,\"\",0,-1),_xlfn.XLOOKUP(\"RED\",$D$7:D202,$A$7:A202,\"\",0,-1)),A202-6)","v":1},"","","","","",280,"",50,1]
[{"$f":"ROW()","v":203},31,{"$f":"_xlfn.XLOOKUP(B203,AUX!$A:$A,AUX!$B:$B,\"\",0,1)","v":"RED"},{"$f":"IF(C203=0,INDEX($C:$C,MAX(_xlfn.XLOOKUP(\"BLACK\",$C$7:C203,$A$7:A203,\"\",0,-1),_xlfn.XLOOKUP(\"RED\",$C$7:C203,$A$7:A203,\"\",0,-1)),1),C203)","v":"RED"},{"$f":"IF(AND(COUNTIF($D$7:D203,\"RED\")>0,COUNTIF($D$7:D203,\"BLACK\")>0),A203-MIN(_xlfn.XLOOKUP(\"BLACK\",$D$7:D203,$A$7:A203,\"\",0,-1),_xlfn.XLOOKUP(\"RED\",$D$7:D203,$A$7:A203,\"\",0,-1)),A203-6)","v":1},"BET","RED","SUCCESS",5,10,285,"",50,1]
[{"$f":"ROW()","v":204},24,{"$f":"_xlfn.XLOOKUP(B204,AUX!$A:$A,AUX!$B:$B,\"\",0,1)","v":"BLACK"},{"$f":"IF(C204=0,INDEX($C:$C,MAX(_xlfn.XLOOKUP(\"BLACK\",$C$7:C204,$A$7:A204,\"\",0,-1),_xlfn.XLOOKUP(\"RED\",$C$7:C204,$A$7:A204,\"\",0,-1)),1),C204)","v":"BLACK"},{"$f":"IF(AND(COUNTIF($D$7:D204,\"RED\")>0,COUNTIF($D$7:D204,\"BLACK\")>0),A204-MIN(_xlfn.XLOOKUP(\"BLACK\",$D$7:D204,$A$7:A204,\"\",0,-1),_xlfn.XLOOKUP(\"RED\",$D$7:D204,$A$7:A204,\"\",0,-1)),A204-6)","v":1},"BET","BLACK","SUCCESS",5,10,290,"",50,""]
[{"$f":"ROW()","v":205},26,{"$f":"_xlfn.XLOOKUP(B205,AUX!$A:$A,AUX!$B:$B,\"\",0,1)","v":"BLACK"},{"$f":"IF(C205=0,INDEX($C:$C,MAX(_xlfn.XLOOKUP(\"BLACK\",$C$7:C205,$A$7:A205,\"\",0,-1),_xlfn.XLOOKUP(\"RED\",$C$7:C205,$A$7:A205,\"\",0,-1)),1),C205)","v":"BLACK"},{"$f":"IF(AND(COUNTIF($D$7:D205,\"RED\")>0,COUNTIF($D$7:D205,\"BLACK\")>0),A205-MIN(_xlfn.XLOOKUP(\"BLACK\",$D$7:D205,$A$7:A205,\"\",0,-1),_xlfn.XLOOKUP(\"RED\",$D$7:D205,$A$7:A205,\"\",0,-1)),A205-6)","v":2},"BET","RED","FAIL",5,0,285,"STOP",100,""]
[{"$f":"ROW()","v":206},12,{"$f":"_xlfn.XLOOKUP(B206,AUX!$A:$A,AUX!$B:$B,\"\",0,1)","v":"BLACK"},{"$f":"IF(C206=0,INDEX($C:$C,MAX(_xlfn.XLOOKUP(\"BLACK\",$C$7:C206,$A$7:A206,\"\",0,-1),_xlfn.XLOOKUP(\"RED\",$C$7:C206,$A$7:A206,\"\",0,-1)),1),C206)","v":"BLACK"},{"$f":"IF(AND(COUNTIF($D$7:D206,\"RED\")>0,COUNTIF($D$7:D206,\"BLACK\")>0),A206-MIN(_xlfn.XLOOKUP(\"BLACK\",$D$7:D206,$A$7:A206,\"\",0,-1),_xlfn.XLOOKUP(\"RED\",$D$7:D206,$A$7:A206,\"\",0,-1)),A206-6)","v":3},"","","","","",285,"STOP",150,""]
[{"$f":"ROW()","v":207},2,{"$f":"_xlfn.XLOOKUP(B207,AUX!$A:$A,AUX!$B:$B,\"\",0,1)","v":"BLACK"},{"$f":"IF(C207=0,INDEX($C:$C,MAX(_xlfn.XLOOKUP(\"BLACK\",$C$7:C207,$A$7:A207,\"\",0,-1),_xlfn.XLOOKUP(\"RED\",$C$7:C207,$A$7:A207,\"\",0,-1)),1),C207)","v":"BLACK"},{"$f":"IF(AND(COUNTIF($D$7:D207,\"RED\")>0,COUNTIF($D$7:D207,\"BLACK\")>0),A207-MIN(_xlfn.XLOOKUP(\"BLACK\",$D$7:D207,$A$7:A207,\"\",0,-1),_xlfn.XLOOKUP(\"RED\",$D$7:D207,$A$7:A207,\"\",0,-1)),A207-6)","v":4},"","","","","",285,"STOP",200,4]
[{"$f":"ROW()","v":208},31,{"$f":"_xlfn.XLOOKUP(B208,AUX!$A:$A,AUX!$B:$B,\"\",0,1)","v":"RED"},{"$f":"IF(C208=0,INDEX($C:$C,MAX(_xlfn.XLOOKUP(\"BLACK\",$C$7:C208,$A$7:A208,\"\",0,-1),_xlfn.XLOOKUP(\"RED\",$C$7:C208,$A$7:A208,\"\",0,-1)),1),C208)","v":"RED"},{"$f":"IF(AND(COUNTIF($D$7:D208,\"RED\")>0,COUNTIF($D$7:D208,\"BLACK\")>0),A208-MIN(_xlfn.XLOOKUP(\"BLACK\",$D$7:D208,$A$7:A208,\"\",0,-1),_xlfn.XLOOKUP(\"RED\",$D$7:D208,$A$7:A208,\"\",0,-1)),A208-6)","v":1},"","","","","",285,"",50,1]
[{"$f":"ROW()","v":209},12,{"$f":"_xlfn.XLOOKUP(B209,AUX!$A:$A,AUX!$B:$B,\"\",0,1)","v":"BLACK"},{"$f":"IF(C209=0,INDEX($C:$C,MAX(_xlfn.XLOOKUP(\"BLACK\",$C$7:C209,$A$7:A209,\"\",0,-1),_xlfn.XLOOKUP(\"RED\",$C$7:C209,$A$7:A209,\"\",0,-1)),1),C209)","v":"BLACK"},{"$f":"IF(AND(COUNTIF($D$7:D209,\"RED\")>0,COUNTIF($D$7:D209,\"BLACK\")>0),A209-MIN(_xlfn.XLOOKUP(\"BLACK\",$D$7:D209,$A$7:A209,\"\",0,-1),_xlfn.XLOOKUP(\"RED\",$D$7:D209,$A$7:A209,\"\",0,-1)),A209-6)","v":1},"BET","BLACK","SUCCESS",5,10,290,"",50,1]
[{"$f":"ROW()","v":210},3,{"$f":"_xlfn.XLOOKUP(B210,AUX!$A:$A,AUX!$B:$B,\"\",0,1)","v":"RED"},{"$f":"IF(C210=0,INDEX($C:$C,MAX(_xlfn.XLOOKUP(\"BLACK\",$C$7:C210,$A$7:A210,\"\",0,-1),_xlfn.XLOOKUP(\"RED\",$C$7:C210,$A$7:A210,\"\",0,-1)),1),C210)","v":"RED"},{"$f":"IF(AND(COUNTIF($D$7:D210,\"RED\")>0,COUNTIF($D$7:D210,\"BLACK\")>0),A210-MIN(_xlfn.XLOOKUP(\"BLACK\",$D$7:D210,$A$7:A210,\"\",0,-1),_xlfn.XLOOKUP(\"RED\",$D$7:D210,$A$7:A210,\"\",0,-1)),A210-6)","v":1},"BET","RED","SUCCESS",5,10,295,"",50,1]
[{"$f":"ROW()","v":211},36,{"$f":"_xlfn.XLOOKUP(B211,AUX!$A:$A,AUX!$B:$B,\"\",0,1)","v":"BLACK"},{"$f":"IF(C211=0,INDEX($C:$C,MAX(_xlfn.XLOOKUP(\"BLACK\",$C$7:C211,$A$7:A211,\"\",0,-1),_xlfn.XLOOKUP(\"RED\",$C$7:C211,$A$7:A211,\"\",0,-1)),1),C211)","v":"BLACK"},{"$f":"IF(AND(COUNTIF($D$7:D211,\"RED\")>0,COUNTIF($D$7:D211,\"BLACK\")>0),A211-MIN(_xlfn.XLOOKUP(\"BLACK\",$D$7:D211,$A$7:A211,\"\",0,-1),_xlfn.XLOOKUP(\"RED\",$D$7:D211,$A$7:A211,\"\",0,-1)),A211-6)","v":1},"BET","BLACK","SUCCESS",5,10,300,"",50,1]
[{"$f":"ROW()","v":212},13,{"$f":"_xlfn.XLOOKUP(B212,AUX!$A:$A,AUX!$B:$B,\"\",0,1)","v":"RED"},{"$f":"IF(C212=0,INDEX($C:$C,MAX(_xlfn.XLOOKUP(\"BLACK\",$C$7:C212,$A$7:A212,\"\",0,-1),_xlfn.XLOOKUP(\"RED\",$C$7:C212,$A$7:A212,\"\",0,-1)),1),C212)","v":"RED"},{"$f":"IF(AND(COUNTIF($D$7:D212,\"RED\")>0,COUNTIF($D$7:D212,\"BLACK\")>0),A212-MIN(_xlfn.XLOOKUP(\"BLACK\",$D$7:D212,$A$7:A212,\"\",0,-1),_xlfn.XLOOKUP(\"RED\",$D$7:D212,$A$7:A212,\"\",0,-1)),A212-6)","v":1},"BET","RED","SUCCESS",5,10,305,"",50,""]
[{"$f":"ROW()","v":213},0,{"$f":"_xlfn.XLOOKUP(B213,AUX!$A:$A,AUX!$B:$B,\"\",0,1)","v":0},{"$f":"IF(C213=0,INDEX($C:$C,MAX(_xlfn.XLOOKUP(\"BLACK\",$C$7:C213,$A$7:A213,\"\",0,-1),_xlfn.XLOOKUP(\"RED\",$C$7:C213,$A$7:A213,\"\",0,-1)),1),C213)","v":"RED"},{"$f":"IF(AND(COUNTIF($D$7:D213,\"RED\")>0,COUNTIF($D$7:D213,\"BLACK\")>0),A213-MIN(_xlfn.XLOOKUP(\"BLACK\",$D$7:D213,$A$7:A213,\"\",0,-1),_xlfn.XLOOKUP(\"RED\",$D$7:D213,$A$7:A213,\"\",0,-1)),A213-6)","v":2},"BET","BLACK","FAIL",5,0,300,"STOP",100,2]
[{"$f":"ROW()","v":214},30,{"$f":"_xlfn.XLOOKUP(B214,AUX!$A:$A,AUX!$B:$B,\"\",0,1)","v":"BLACK"},{"$f":"IF(C214=0,INDEX($C:$C,MAX(_xlfn.XLOOKUP(\"BLACK\",$C$7:C214,$A$7:A214,\"\",0,-1),_xlfn.XLOOKUP(\"RED\",$C$7:C214,$A$7:A214,\"\",0,-1)),1),C214)","v":"BLACK"},{"$f":"IF(AND(COUNTIF($D$7:D214,\"RED\")>0,COUNTIF($D$7:D214,\"BLACK\")>0),A214-MIN(_xlfn.XLOOKUP(\"BLACK\",$D$7:D214,$A$7:A214,\"\",0,-1),_xlfn.XLOOKUP(\"RED\",$D$7:D214,$A$7:A214,\"\",0,-1)),A214-6)","v":1},"","","","","",300,"",50,1]
[{"$f":"ROW()","v":215},27,{"$f":"_xlfn.XLOOKUP(B215,AUX!$A:$A,AUX!$B:$B,\"\",0,1)","v":"RED"},{"$f":"IF(C215=0,INDEX($C:$C,MAX(_xlfn.XLOOKUP(\"BLACK\",$C$7:C215,$A$7:A215,\"\",0,-1),_xlfn.XLOOKUP(\"RED\",$C$7:C215,$A$7:A215,\"\",0,-1)),1),C215)","v":"RED"},{"$f":"IF(AND(COUNTIF($D$7:D215,\"RED\")>0,COUNTIF($D$7:D215,\"BLACK\")>0),A215-MIN(_xlfn.XLOOKUP(\"BLACK\",$D$7:D215,$A$7:A215,\"\",0,-1),_xlfn.XLOOKUP(\"RED\",$D$7:D215,$A$7:A215,\"\",0,-1)),A215-6)","v":1},"BET","RED","SUCCESS",5,10,305,"",50,""]
[{"$f":"ROW()","v":216},5,{"$f":"_xlfn.XLOOKUP(B216,AUX!$A:$A,AUX!$B:$B,\"\",0,1)","v":"RED"},{"$f":"IF(C216=0,INDEX($C:$C,MAX(_xlfn.XLOOKUP(\"BLACK\",$C$7:C216,$A$7:A216,\"\",0,-1),_xlfn.XLOOKUP(\"RED\",$C$7:C216,$A$7:A216,\"\",0,-1)),1),C216)","v":"RED"},{"$f":"IF(AND(COUNTIF($D$7:D216,\"RED\")>0,COUNTIF($D$7:D216,\"BLACK\")>0),A216-MIN(_xlfn.XLOOKUP(\"BLACK\",$D$7:D216,$A$7:A216,\"\",0,-1),_xlfn.XLOOKUP(\"RED\",$D$7:D216,$A$7:A216,\"\",0,-1)),A216-6)","v":2},"BET","BLACK","FAIL",5,0,300,"STOP",100,""]
[{"$f":"ROW()","v":217},27,{"$f":"_xlfn.XLOOKUP(B217,AUX!$A:$A,AUX!$B:$B,\"\",0,1)","v":"RED"},{"$f":"IF(C217=0,INDEX($C:$C,MAX(_xlfn.XLOOKUP(\"BLACK\",$C$7:C217,$A$7:A217,\"\",0,-1),_xlfn.XLOOKUP(\"RED\",$C$7:C217,$A$7:A217,\"\",0,-1)),1),C217)","v":"RED"},{"$f":"IF(AND(COUNTIF($D$7:D217,\"RED\")>0,COUNTIF($D$7:D217,\"BLACK\")>0),A217-MIN(_xlfn.XLOOKUP(\"BLACK\",$D$7:D217,$A$7:A217,\"\",0,-1),_xlfn.XLOOKUP(\"RED\",$D$7:D217,$A$7:A217,\"\",0,-1)),A217-6)","v":3},"","","","","",300,"STOP",150,3]
[{"$f":"ROW()","v":218},12,{"$f":"_xlfn.XLOOKUP(B218,AUX!$A:$A,AUX!$B:$B,\"\",0,1)","v":"BLACK"},{"$f":"IF(C218=0,INDEX($C:$C,MAX(_xlfn.XLOOKUP(\"BLACK\",$C$7:C218,$A$7:A218,\"\",0,-1),_xlfn.XLOOKUP(\"RED\",$C$7:C218,$A$7:A218,\"\",0,-1)),1),C218)","v":"BLACK"},{"$f":"IF(AND(COUNTIF($D$7:D218,\"RED\")>0,COUNTIF($D$7:D218,\"BLACK\")>0),A218-MIN(_xlfn.XLOOKUP(\"BLACK\",$D$7:D218,$A$7:A218,\"\",0,-1),_xlfn.XLOOKUP(\"RED\",$D$7:D218,$A$7:A218,\"\",0,-1)),A218-6)","v":1},"","","","","",300,"",50,1]
[{"$f":"ROW()","v":219},9,{"$f":"_xlfn.XLOOKUP(B219,AUX!$A:$A,AUX!$B:$B,\"\",0,1)","v":"RED"},{"$f":"IF(C219=0,INDEX($C:$C,MAX(_xlfn.XLOOKUP(\"BLACK\",$C$7:C219,$A$7:A219,\"\",0,-1),_xlfn.XLOOKUP(\"RED\",$C$7:C219,$A$7:A219,\"\",0,-1)),1),C219)","v":"RED"},{"$f":"IF(AND(COUNTIF($D$7:D219,\"RED\")>0,COUNTIF($D$7:D219,\"BLACK\")>0),A219-MIN(_xlfn.XLOOKUP(\"BLACK\",$D$7:D219,$A$7:A219,\"\",0,-1),_xlfn.XLOOKUP(\"RED\",$D$7:D219,$A$7:A219,\"\",0,-1)),A219-6)","v":1},"BET","RED","SUCCESS",5,10,305,"",50,""]
[{"$f":"ROW()","v":220},0,{"$f":"_xlfn.XLOOKUP(B220,AUX!$A:$A,AUX!$B:$B,\"\",0,1)","v":0},{"$f":"IF(C220=0,INDEX($C:$C,MAX(_xlfn.XLOOKUP(\"BLACK\",$C$7:C220,$A$7:A220,\"\",0,-1),_xlfn.XLOOKUP(\"RED\",$C$7:C220,$A$7:A220,\"\",0,-1)),1),C220)","v":"RED"},{"$f":"IF(AND(COUNTIF($D$7:D220,\"RED\")>0,COUNTIF($D$7:D220,\"BLACK\")>0),A220-MIN(_xlfn.XLOOKUP(\"BLACK\",$D$7:D220,$A$7:A220,\"\",0,-1),_xlfn.XLOOKUP(\"RED\",$D$7:D220,$A$7:A220,\"\",0,-1)),A220-6)","v":2},"BET","BLACK","FAIL",5,0,300,"STOP",100,""]
[{"$f":"ROW()","v":221},5,{"$f":"_xlfn.XLOOKUP(B221,AUX!$A:$A,AUX!$B:$B,\"\",0,1)","v":"RED"},{"$f":"IF(C221=0,INDEX($C:$C,MAX(_xlfn.XLOOKUP(\"BLACK\",$C$7:C221,$A$7:A221,\"\",0,-1),_xlfn.XLOOKUP(\"RED\",$C$7:C221,$A$7:A221,\"\",0,-1)),1),C221)","v":"RED"},{"$f":"IF(AND(COUNTIF($D$7:D221,\"RED\")>0,COUNTIF($D$7:D221,\"BLACK\")>0),A221-MIN(_xlfn.XLOOKUP(\"BLACK\",$D$7:D221,$A$7:A221,\"\",0,-1),_xlfn.XLOOKUP(\"RED\",$D$7:D221,$A$7:A221,\"\",0,-1)),A221-6)","v":3},{"$f":"IF(AND(E220>=$E$3,L220=\"\"),\"BET\",\"\")","v":""},{"$f":"IF(F221=\"BET\",IF(D220=\"RED\",\"BLACK\",IF(D220=\"BLACK\",\"RED\",\"ERROR\")),\"\")","v":""},{"$f":"IF(F221=\"BET\",IF(D221=G221,\"SUCCESS\",\"FAIL\"),\"\")","v":""},{"$f":"IF(F221=\"BET\",IF(OR(I220>=$G$4,F220=\"\"),$F$3,IF(AND(F220=\"BET\",H220=\"FAIL\"),I220*2,$F$3)),\"\")","v":""},{"$f":"IF(F221=\"BET\",IF(H221=\"SUCCESS\",I221*2,0),\"\")","v":""},{"$f":"IF(F221=\"BET\",K220-I221+J221,K220)","v":300},"STOP",{"$f":"E221*50","v":150},""]
[{"$f":"ROW()","v":222},0,{"$f":"_xlfn.XLOOKUP(B222,AUX!$A:$A,AUX!$B:$B,\"\",0,1)","v":0},{"$f":"IF(C222=0,INDEX($C:$C,MAX(_xlfn.XLOOKUP(\"BLACK\",$C$7:C222,$A$7:A222,\"\",0,-1),_xlfn.XLOOKUP(\"RED\",$C$7:C222,$A$7:A222,\"\",0,-1)),1),C222)","v":"RED"},{"$f":"IF(AND(COUNTIF($D$7:D222,\"RED\")>0,COUNTIF($D$7:D222,\"BLACK\")>0),A222-MIN(_xlfn.XLOOKUP(\"BLACK\",$D$7:D222,$A$7:A222,\"\",0,-1),_xlfn.XLOOKUP(\"RED\",$D$7:D222,$A$7:A222,\"\",0,-1)),A222-6)","v":4},"","","","","",300,"STOP",200,""]
[{"$f":"ROW()","v":223},3,{"$f":"_xlfn.XLOOKUP(B223,AUX!$A:$A,AUX!$B:$B,\"\",0,1)","v":"RED"},{"$f":"IF(C223=0,INDEX($C:$C,MAX(_xlfn.XLOOKUP(\"BLACK\",$C$7:C223,$A$7:A223,\"\",0,-1),_xlfn.XLOOKUP(\"RED\",$C$7:C223,$A$7:A223,\"\",0,-1)),1),C223)","v":"RED"},{"$f":"IF(AND(COUNTIF($D$7:D223,\"RED\")>0,COUNTIF($D$7:D223,\"BLACK\")>0),A223-MIN(_xlfn.XLOOKUP(\"BLACK\",$D$7:D223,$A$7:A223,\"\",0,-1),_xlfn.XLOOKUP(\"RED\",$D$7:D223,$A$7:A223,\"\",0,-1)),A223-6)","v":5},"","","","","",300,"STOP",250,5]
[{"$f":"ROW()","v":224},32,{"$f":"_xlfn.XLOOKUP(B224,AUX!$A:$A,AUX!$B:$B,\"\",0,1)","v":"BLACK"},{"$f":"IF(C224=0,INDEX($C:$C,MAX(_xlfn.XLOOKUP(\"BLACK\",$C$7:C224,$A$7:A224,\"\",0,-1),_xlfn.XLOOKUP(\"RED\",$C$7:C224,$A$7:A224,\"\",0,-1)),1),C224)","v":"BLACK"},{"$f":"IF(AND(COUNTIF($D$7:D224,\"RED\")>0,COUNTIF($D$7:D224,\"BLACK\")>0),A224-MIN(_xlfn.XLOOKUP(\"BLACK\",$D$7:D224,$A$7:A224,\"\",0,-1),_xlfn.XLOOKUP(\"RED\",$D$7:D224,$A$7:A224,\"\",0,-1)),A224-6)","v":1},"","","","","",300,"",50,""]
[{"$f":"ROW()","v":225},10,{"$f":"_xlfn.XLOOKUP(B225,AUX!$A:$A,AUX!$B:$B,\"\",0,1)","v":"BLACK"},{"$f":"IF(C225=0,INDEX($C:$C,MAX(_xlfn.XLOOKUP(\"BLACK\",$C$7:C225,$A$7:A225,\"\",0,-1),_xlfn.XLOOKUP(\"RED\",$C$7:C225,$A$7:A225,\"\",0,-1)),1),C225)","v":"BLACK"},{"$f":"IF(AND(COUNTIF($D$7:D225,\"RED\")>0,COUNTIF($D$7:D225,\"BLACK\")>0),A225-MIN(_xlfn.XLOOKUP(\"BLACK\",$D$7:D225,$A$7:A225,\"\",0,-1),_xlfn.XLOOKUP(\"RED\",$D$7:D225,$A$7:A225,\"\",0,-1)),A225-6)","v":2},"BET","RED","FAIL",5,0,295,"STOP",100,""]
[{"$f":"ROW()","v":226},34,{"$f":"_xlfn.XLOOKUP(B226,AUX!$A:$A,AUX!$B:$B,\"\",0,1)","v":"BLACK"},{"$f":"IF(C226=0,INDEX($C:$C,MAX(_xlfn.XLOOKUP(\"BLACK\",$C$7:C226,$A$7:A226,\"\",0,-1),_xlfn.XLOOKUP(\"RED\",$C$7:C226,$A$7:A226,\"\",0,-1)),1),C226)","v":"BLACK"},{"$f":"IF(AND(COUNTIF($D$7:D226,\"RED\")>0,COUNTIF($D$7:D226,\"BLACK\")>0),A226-MIN(_xlfn.XLOOKUP(\"BLACK\",$D$7:D226,$A$7:A226,\"\",0,-1),_xlfn.XLOOKUP(\"RED\",$D$7:D226,$A$7:A226,\"\",0,-1)),A226-6)","v":3},"","","","","",295,"STOP",150,3]
[{"$f":"ROW()","v":227},3,{"$f":"_xlfn.XLOOKUP(B227,AUX!$A:$A,AUX!$B:$B,\"\",0,1)","v":"RED"},{"$f":"IF(C227=0,INDEX($C:$C,MAX(_xlfn.XLOOKUP(\"BLACK\",$C$7:C227,$A$7:A227,\"\",0,-1),_xlfn.XLOOKUP(\"RED\",$C$7:C227,$A$7:A227,\"\",0,-1)),1),C227)","v":"RED"},{"$f":"IF(AND(COUNTIF($D$7:D227,\"RED\")>0,COUNTIF($D$7:D227,\"BLACK\")>0),A227-MIN(_xlfn.XLOOKUP(\"BLACK\",$D$7:D227,$A$7:A227,\"\",0,-1),_xlfn.XLOOKUP(\"RED\",$D$7:D227,$A$7:A227,\"\",0,-1)),A227-6)","v":1},"","","","","",295,"",50,""]
[{"$f":"ROW()","v":228},1,{"$f":"_xlfn.XLOOKUP(B228,AUX!$A:$A,AUX!$B:$B,\"\",0,1)","v":"RED"},{"$f":"IF(C228=0,INDEX($C:$C,MAX(_xlfn.XLOOKUP(\"BLACK\",$C$7:C228,$A$7:A228,\"\",0,-1),_xlfn.XLOOKUP(\"RED\",$C$7:C228,$A$7:A228,\"\",0,-1)),1),C228)","v":"RED"},{"$f":"IF(AND(COUNTIF($D$7:D228,\"RED\")>0,COUNTIF($D$7:D228,\"BLACK\")>0),A228-MIN(_xlfn.XLOOKUP(\"BLACK\",$D$7:D228,$A$7:A228,\"\",0,-1),_xlfn.XLOOKUP(\"RED\",$D$7:D228,$A$7:A228,\"\",0,-1)),A228-6)","v":2},"BET","BLACK","FAIL",5,0,290,"STOP",100,2]
[{"$f":"ROW()","v":229},18,{"$f":"_xlfn.XLOOKUP(B229,AUX!$A:$A,AUX!$B:$B,\"\",0,1)","v":"BLACK"},{"$f":"IF(C229=0,INDEX($C:$C,MAX(_xlfn.XLOOKUP(\"BLACK\",$C$7:C229,$A$7:A229,\"\",0,-1),_xlfn.XLOOKUP(\"RED\",$C$7:C229,$A$7:A229,\"\",0,-1)),1),C229)","v":"BLACK"},{"$f":"IF(AND(COUNTIF($D$7:D229,\"RED\")>0,COUNTIF($D$7:D229,\"BLACK\")>0),A229-MIN(_xlfn.XLOOKUP(\"BLACK\",$D$7:D229,$A$7:A229,\"\",0,-1),_xlfn.XLOOKUP(\"RED\",$D$7:D229,$A$7:A229,\"\",0,-1)),A229-6)","v":1},"","","","","",290,"",50,""]
[{"$f":"ROW()","v":230},16,{"$f":"_xlfn.XLOOKUP(B230,AUX!$A:$A,AUX!$B:$B,\"\",0,1)","v":"BLACK"},{"$f":"IF(C230=0,INDEX($C:$C,MAX(_xlfn.XLOOKUP(\"BLACK\",$C$7:C230,$A$7:A230,\"\",0,-1),_xlfn.XLOOKUP(\"RED\",$C$7:C230,$A$7:A230,\"\",0,-1)),1),C230)","v":"BLACK"},{"$f":"IF(AND(COUNTIF($D$7:D230,\"RED\")>0,COUNTIF($D$7:D230,\"BLACK\")>0),A230-MIN(_xlfn.XLOOKUP(\"BLACK\",$D$7:D230,$A$7:A230,\"\",0,-1),_xlfn.XLOOKUP(\"RED\",$D$7:D230,$A$7:A230,\"\",0,-1)),A230-6)","v":2},"BET","RED","FAIL",5,0,285,"STOP",100,""]
[{"$f":"ROW()","v":231},18,{"$f":"_xlfn.XLOOKUP(B231,AUX!$A:$A,AUX!$B:$B,\"\",0,1)","v":"BLACK"},{"$f":"IF(C231=0,INDEX($C:$C,MAX(_xlfn.XLOOKUP(\"BLACK\",$C$7:C231,$A$7:A231,\"\",0,-1),_xlfn.XLOOKUP(\"RED\",$C$7:C231,$A$7:A231,\"\",0,-1)),1),C231)","v":"BLACK"},{"$f":"IF(AND(COUNTIF($D$7:D231,\"RED\")>0,COUNTIF($D$7:D231,\"BLACK\")>0),A231-MIN(_xlfn.XLOOKUP(\"BLACK\",$D$7:D231,$A$7:A231,\"\",0,-1),_xlfn.XLOOKUP(\"RED\",$D$7:D231,$A$7:A231,\"\",0,-1)),A231-6)","v":3},"","","","","",285,"STOP",150,""]
[{"$f":"ROW()","v":232},32,{"$f":"_xlfn.XLOOKUP(B232,AUX!$A:$A,AUX!$B:$B,\"\",0,1)","v":"BLACK"},{"$f":"IF(C232=0,INDEX($C:$C,MAX(_xlfn.XLOOKUP(\"BLACK\",$C$7:C232,$A$7:A232,\"\",0,-1),_xlfn.XLOOKUP(\"RED\",$C$7:C232,$A$7:A232,\"\",0,-1)),1),C232)","v":"BLACK"},{"$f":"IF(AND(COUNTIF($D$7:D232,\"RED\")>0,COUNTIF($D$7:D232,\"BLACK\")>0),A232-MIN(_xlfn.XLOOKUP(\"BLACK\",$D$7:D232,$A$7:A232,\"\",0,-1),_xlfn.XLOOKUP(\"RED\",$D$7:D232,$A$7:A232,\"\",0,-1)),A232-6)","v":4},"","","","","",285,"STOP",200,4]
[{"$f":"ROW()","v":233},19,{"$f":"_xlfn.XLOOKUP(B233,AUX!$A:$A,AUX!$B:$B,\"\",0,1)","v":"RED"},{"$f":"IF(C233=0,INDEX($C:$C,MAX(_xlfn.XLOOKUP(\"BLACK\",$C$7:C233,$A$7:A233,\"\",0,-1),_xlfn.XLOOKUP(\"RED\",$C$7:C233,$A$7:A233,\"\",0,-1)),1),C233)","v":"RED"},{"$f":"IF(AND(COUNTIF($D$7:D233,\"RED\")>0,COUNTIF($D$7:D233,\"BLACK\")>0),A233-MIN(_xlfn.XLOOKUP(\"BLACK\",$D$7:D233,$A$7:A233,\"\",0,-1),_xlfn.XLOOKUP(\"RED\",$D$7:D233,$A$7:A233,\"\",0,-1)),A233-6)","v":1},"","","","","",285,"",50,""]
[{"$f":"ROW()","v":234},27,{"$f":"_xlfn.XLOOKUP(B234,AUX!$A:$A,AUX!$B:$B,\"\",0,1)","v":"RED"},{"$f":"IF(C234=0,INDEX($C:$C,MAX(_xlfn.XLOOKUP(\"BLACK\",$C$7:C234,$A$7:A234,\"\",0,-1),_xlfn.XLOOKUP(\"RED\",$C$7:C234,$A$7:A234,\"\",0,-1)),1),C234)","v":"RED"},{"$f":"IF(AND(COUNTIF($D$7:D234,\"RED\")>0,COUNTIF($D$7:D234,\"BLACK\")>0),A234-MIN(_xlfn.XLOOKUP(\"BLACK\",$D$7:D234,$A$7:A234,\"\",0,-1),_xlfn.XLOOKUP(\"RED\",$D$7:D234,$A$7:A234,\"\",0,-1)),A234-6)","v":2},"BET","BLACK","FAIL",5,0,280,"STOP",100,""]
[{"$f":"ROW()","v":235},35,{"$f":"_xlfn.XLOOKUP(B235,AUX!$A:$A,AUX!$B:$B,\"\",0,1)","v":"RED"},{"$f":"IF(C235=0,INDEX($C:$C,MAX(_xlfn.XLOOKUP(\"BLACK\",$C$7:C235,$A$7:A235,\"\",0,-1),_xlfn.XLOOKUP(\"RED\",$C$7:C235,$A$7:A235,\"\",0,-1)),1),C235)","v":"RED"},{"$f":"IF(AND(COUNTIF($D$7:D235,\"RED\")>0,COUNTIF($D$7:D235,\"BLACK\")>0),A235-MIN(_xlfn.XLOOKUP(\"BLACK\",$D$7:D235,$A$7:A235,\"\",0,-1),_xlfn.XLOOKUP(\"RED\",$D$7:D235,$A$7:A235,\"\",0,-1)),A235-6)","v":3},"","","","","",280,"STOP",150,""]
[{"$f":"ROW()","v":236},7,{"$f":"_xlfn.XLOOKUP(B236,AUX!$A:$A,AUX!$B:$B,\"\",0,1)","v":"RED"},{"$f":"IF(C236=0,INDEX($C:$C,MAX(_xlfn.XLOOKUP(\"BLACK\",$C$7:C236,$A$7:A236,\"\",0,-1),_xlfn.XLOOKUP(\"RED\",$C$7:C236,$A$7:A236,\"\",0,-1)),1),C236)","v":"RED"},{"$f":"IF(AND(COUNTIF($D$7:D236,\"RED\")>0,COUNTIF($D$7:D236,\"BLACK\")>0),A236-MIN(_xlfn.XLOOKUP(\"BLACK\",$D$7:D236,$A$7:A236,\"\",0,-1),_xlfn.XLOOKUP(\"RED\",$D$7:D236,$A$7:A236,\"\",0,-1)),A236-6)","v":4},"","","","","",280,"STOP",200,""]
[{"$f":"ROW()","v":237},21,{"$f":"_xlfn.XLOOKUP(B237,AUX!$A:$A,AUX!$B:$B,\"\",0,1)","v":"RED"},{"$f":"IF(C237=0,INDEX($C:$C,MAX(_xlfn.XLOOKUP(\"BLACK\",$C$7:C237,$A$7:A237,\"\",0,-1),_xlfn.XLOOKUP(\"RED\",$C$7:C237,$A$7:A237,\"\",0,-1)),1),C237)","v":"RED"},{"$f":"IF(AND(COUNTIF($D$7:D237,\"RED\")>0,COUNTIF($D$7:D237,\"BLACK\")>0),A237-MIN(_xlfn.XLOOKUP(\"BLACK\",$D$7:D237,$A$7:A237,\"\",0,-1),_xlfn.XLOOKUP(\"RED\",$D$7:D237,$A$7:A237,\"\",0,-1)),A237-6)","v":5},"","","","","",280,"STOP",250,""]
[{"$f":"ROW()","v":238},15,{"$f":"_xlfn.XLOOKUP(B238,AUX!$A:$A,AUX!$B:$B,\"\",0,1)","v":"RED"},{"$f":"IF(C238=0,INDEX($C:$C,MAX(_xlfn.XLOOKUP(\"BLACK\",$C$7:C238,$A$7:A238,\"\",0,-1),_xlfn.XLOOKUP(\"RED\",$C$7:C238,$A$7:A238,\"\",0,-1)),1),C238)","v":"RED"},{"$f":"IF(AND(COUNTIF($D$7:D238,\"RED\")>0,COUNTIF($D$7:D238,\"BLACK\")>0),A238-MIN(_xlfn.XLOOKUP(\"BLACK\",$D$7:D238,$A$7:A238,\"\",0,-1),_xlfn.XLOOKUP(\"RED\",$D$7:D238,$A$7:A238,\"\",0,-1)),A238-6)","v":6},"","","","","",280,"STOP",300,6]
[{"$f":"ROW()","v":239},6,{"$f":"_xlfn.XLOOKUP(B239,AUX!$A:$A,AUX!$B:$B,\"\",0,1)","v":"BLACK"},{"$f":"IF(C239=0,INDEX($C:$C,MAX(_xlfn.XLOOKUP(\"BLACK\",$C$7:C239,$A$7:A239,\"\",0,-1),_xlfn.XLOOKUP(\"RED\",$C$7:C239,$A$7:A239,\"\",0,-1)),1),C239)","v":"BLACK"},{"$f":"IF(AND(COUNTIF($D$7:D239,\"RED\")>0,COUNTIF($D$7:D239,\"BLACK\")>0),A239-MIN(_xlfn.XLOOKUP(\"BLACK\",$D$7:D239,$A$7:A239,\"\",0,-1),_xlfn.XLOOKUP(\"RED\",$D$7:D239,$A$7:A239,\"\",0,-1)),A239-6)","v":1},"","","","","",280,"",50,""]
[{"$f":"ROW()","v":240},10,{"$f":"_xlfn.XLOOKUP(B240,AUX!$A:$A,AUX!$B:$B,\"\",0,1)","v":"BLACK"},{"$f":"IF(C240=0,INDEX($C:$C,MAX(_xlfn.XLOOKUP(\"BLACK\",$C$7:C240,$A$7:A240,\"\",0,-1),_xlfn.XLOOKUP(\"RED\",$C$7:C240,$A$7:A240,\"\",0,-1)),1),C240)","v":"BLACK"},{"$f":"IF(AND(COUNTIF($D$7:D240,\"RED\")>0,COUNTIF($D$7:D240,\"BLACK\")>0),A240-MIN(_xlfn.XLOOKUP(\"BLACK\",$D$7:D240,$A$7:A240,\"\",0,-1),_xlfn.XLOOKUP(\"RED\",$D$7:D240,$A$7:A240,\"\",0,-1)),A240-6)","v":2},"BET","RED","FAIL",5,0,275,"STOP",100,2]
[{"$f":"ROW()","v":241},7,{"$f":"_xlfn.XLOOKUP(B241,AUX!$A:$A,AUX!$B:$B,\"\",0,1)","v":"RED"},{"$f":"IF(C241=0,INDEX($C:$C,MAX(_xlfn.XLOOKUP(\"BLACK\",$C$7:C241,$A$7:A241,\"\",0,-1),_xlfn.XLOOKUP(\"RED\",$C$7:C241,$A$7:A241,\"\",0,-1)),1),C241)","v":"RED"},{"$f":"IF(AND(COUNTIF($D$7:D241,\"RED\")>0,COUNTIF($D$7:D241,\"BLACK\")>0),A241-MIN(_xlfn.XLOOKUP(\"BLACK\",$D$7:D241,$A$7:A241,\"\",0,-1),_xlfn.XLOOKUP(\"RED\",$D$7:D241,$A$7:A241,\"\",0,-1)),A241-6)","v":1},"","","","","",275,"",50,""]
[{"$f":"ROW()","v":242},33,{"$f":"_xlfn.XLOOKUP(B242,AUX!$A:$A,AUX!$B:$B,\"\",0,1)","v":"RED"},{"$f":"IF(C242=0,INDEX($C:$C,MAX(_xlfn.XLOOKUP(\"BLACK\",$C$7:C242,$A$7:A242,\"\",0,-1),_xlfn.XLOOKUP(\"RED\",$C$7:C242,$A$7:A242,\"\",0,-1)),1),C242)","v":"RED"},{"$f":"IF(AND(COUNTIF($D$7:D242,\"RED\")>0,COUNTIF($D$7:D242,\"BLACK\")>0),A242-MIN(_xlfn.XLOOKUP(\"BLACK\",$D$7:D242,$A$7:A242,\"\",0,-1),_xlfn.XLOOKUP(\"RED\",$D$7:D242,$A$7:A242,\"\",0,-1)),A242-6)","v":2},"BET","BLACK","FAIL",5,0,270,"STOP",100,2]
[{"$f":"ROW()","v":243},36,{"$f":"_xlfn.XLOOKUP(B243,AUX!$A:$A,AUX!$B:$B,\"\",0,1)","v":"BLACK"},{"$f":"IF(C243=0,INDEX($C:$C,MAX(_xlfn.XLOOKUP(\"BLACK\",$C$7:C243,$A$7:A243,\"\",0,-1),_xlfn.XLOOKUP(\"RED\",$C$7:C243,$A$7:A243,\"\",0,-1)),1),C243)","v":"BLACK"},{"$f":"IF(AND(COUNTIF($D$7:D243,\"RED\")>0,COUNTIF($D$7:D243,\"BLACK\")>0),A243-MIN(_xlfn.XLOOKUP(\"BLACK\",$D$7:D243,$A$7:A243,\"\",0,-1),_xlfn.XLOOKUP(\"RED\",$D$7:D243,$A$7:A243,\"\",0,-1)),A243-6)","v":1},"","","","","",270,"",50,1]
[{"$f":"ROW()","v":244},27,{"$f":"_xlfn.XLOOKUP(B244,AUX!$A:$A,AUX!$B:$B,\"\",0,1)","v":"RED"},{"$f":"IF(C244=0,INDEX($C:$C,MAX(_xlfn.XLOOKUP(\"BLACK\",$C$7:C244,$A$7:A244,\"\",0,-1),_xlfn.XLOOKUP(\"RED\",$C$7:C244,$A$7:A244,\"\",0,-1)),1),C244)","v":"RED"},{"$f":"IF(AND(COUNTIF($D$7:D244,\"RED\")>0,COUNTIF($D$7:D244,\"BLACK\")>0),A244-MIN(_xlfn.XLOOKUP(\"BLACK\",$D$7:D244,$A$7:A244,\"\",0,-1),_xlfn.XLOOKUP(\"RED\",$D$7:D244,$A$7:A244,\"\",0,-1)),A244-6)","v":1},"BET","RED","SUCCESS",5,10,275,"",50,""]
[{"$f":"ROW()","v":245},33,{"$f":"_xlfn.XLOOKUP(B245,AUX!$A:$A,AUX!$B:$B,\"\",0,1)","v":"RED"},{"$f":"IF(C245=0,INDEX($C:$C,MAX(_xlfn.XLOOKUP(\"BLACK\",$C$7:C245,$A$7:A245,\"\",0,-1),_xlfn.XLOOKUP(\"RED\",$C$7:C245,$A$7:A245,\"\",0,-1)),1),C245)","v":"RED"},{"$f":"IF(AND(COUNTIF($D$7:D245,\"RED\")>0,COUNTIF($D$7:D245,\"BLACK\")>0),A245-MIN(_xlfn.XLOOKUP(\"BLACK\",$D$7:D245,$A$7:A245,\"\",0,-1),_xlfn.XLOOKUP(\"RED\",$D$7:D245,$A$7:A245,\"\",0,-1)),A245-6)","v":2},"BET","BLACK","FAIL",5,0,270,"STOP",100,2]
[{"$f":"ROW()","v":246},32,{"$f":"_xlfn.XLOOKUP(B246,AUX!$A:$A,AUX!$B:$B,\"\",0,1)","v":"BLACK"},{"$f":"IF(C246=0,INDEX($C:$C,MAX(_xlfn.XLOOKUP(\"BLACK\",$C$7:C246,$A$7:A246,\"\",0,-1),_xlfn.XLOOKUP(\"RED\",$C$7:C246,$A$7:A246,\"\",0,-1)),1),C246)","v":"BLACK"},{"$f":"IF(AND(COUNTIF($D$7:D246,\"RED\")>0,COUNTIF($D$7:D246,\"BLACK\")>0),A246-MIN(_xlfn.XLOOKUP(\"BLACK\",$D$7:D246,$A$7:A246,\"\",0,-1),_xlfn.XLOOKUP(\"RED\",$D$7:D246,$A$7:A246,\"\",0,-1)),A246-6)","v":1},"","","","","",270,"",50,1]
[{"$f":"ROW()","v":247},7,{"$f":"_xlfn.XLOOKUP(B247,AUX!$A:$A,AUX!$B:$B,\"\",0,1)","v":"RED"},{"$f":"IF(C247=0,INDEX($C:$C,MAX(_xlfn.XLOOKUP(\"BLACK\",$C$7:C247,$A$7:A247,\"\",0,-1),_xlfn.XLOOKUP(\"RED\",$C$7:C247,$A$7:A247,\"\",0,-1)),1),C247)","v":"RED"},{"$f":"IF(AND(COUNTIF($D$7:D247,\"RED\")>0,COUNTIF($D$7:D247,\"BLACK\")>0),A247-MIN(_xlfn.XLOOKUP(\"BLACK\",$D$7:D247,$A$7:A247,\"\",0,-1),_xlfn.XLOOKUP(\"RED\",$D$7:D247,$A$7:A247,\"\",0,-1)),A247-6)","v":1},"BET","RED","SUCCESS",5,10,275,"",50,""]
[{"$f":"ROW()","v":248},17,{"$f":"_xlfn.XLOOKUP(B248,AUX!$A:$A,AUX!$B:$B,\"\",0,1)","v":"RED"},{"$f":"IF(C248=0,INDEX($C:$C,MAX(_xlfn.XLOOKUP(\"BLACK\",$C$7:C248,$A$7:A248,\"\",0,-1),_xlfn.XLOOKUP(\"RED\",$C$7:C248,$A$7:A248,\"\",0,-1)),1),C248)","v":"RED"},{"$f":"IF(AND(COUNTIF($D$7:D248,\"RED\")>0,COUNTIF($D$7:D248,\"BLACK\")>0),A248-MIN(_xlfn.XLOOKUP(\"BLACK\",$D$7:D248,$A$7:A248,\"\",0,-1),_xlfn.XLOOKUP(\"RED\",$D$7:D248,$A$7:A248,\"\",0,-1)),A248-6)","v":2},"BET","BLACK","FAIL",5,0,270,"STOP",100,""]
[{"$f":"ROW()","v":249},33,{"$f":"_xlfn.XLOOKUP(B249,AUX!$A:$A,AUX!$B:$B,\"\",0,1)","v":"RED"},{"$f":"IF(C249=0,INDEX($C:$C,MAX(_xlfn.XLOOKUP(\"BLACK\",$C$7:C249,$A$7:A249,\"\",0,-1),_xlfn.XLOOKUP(\"RED\",$C$7:C249,$A$7:A249,\"\",0,-1)),1),C249)","v":"RED"},{"$f":"IF(AND(COUNTIF($D$7:D249,\"RED\")>0,COUNTIF($D$7:D249,\"BLACK\")>0),A249-MIN(_xlfn.XLOOKUP(\"BLACK\",$D$7:D249,$A$7:A249,\"\",0,-1),_xlfn.XLOOKUP(\"RED\",$D$7:D249,$A$7:A249,\"\",0,-1)),A249-6)","v":3},"","","","","",270,"STOP",150,""]
[{"$f":"ROW()","v":250},27,{"$f":"_xlfn.XLOOKUP(B250,AUX!$A:$A,AUX!$B:$B,\"\",0,1)","v":"RED"},{"$f":"IF(C250=0,INDEX($C:$C,MAX(_xlfn.XLOOKUP(\"BLACK\",$C$7:C250,$A$7:A250,\"\",0,-1),_xlfn.XLOOKUP(\"RED\",$C$7:C250,$A$7:A250,\"\",0,-1)),1),C250)","v":"RED"},{"$f":"IF(AND(COUNTIF($D$7:D250,\"RED\")>0,COUNTIF($D$7:D250,\"BLACK\")>0),A250-MIN(_xlfn.XLOOKUP(\"BLACK\",$D$7:D250,$A$7:A250,\"\",0,-1),_xlfn.XLOOKUP(\"RED\",$D$7:D250,$A$7:A250,\"\",0,-1)),A250-6)","v":4},"","","","","",270,"STOP",200,""]
[{"$f":"ROW()","v":251},0,{"$f":"_xlfn.XLOOKUP(B251,AUX!$A:$A,AUX!$B:$B,\"\",0,1)","v":0},{"$f":"IF(C251=0,INDEX($C:$C,MAX(_xlfn.XLOOKUP(\"BLACK\",$C$7:C251,$A$7:A251,\"\",0,-1),_xlfn.XLOOKUP(\"RED\",$C$7:C251,$A$7:A251,\"\",0,-1)),1),C251)","v":"RED"},{"$f":"IF(AND(COUNTIF($D$7:D251,\"RED\")>0,COUNTIF($D$7:D251,\"BLACK\")>0),A251-MIN(_xlfn.XLOOKUP(\"BLACK\",$D$7:D251,$A$7:A251,\"\",0,-1),_xlfn.XLOOKUP(\"RED\",$D$7:D251,$A$7:A251,\"\",0,-1)),A251-6)","v":5},"","","","","",270,"STOP",250,5]
[{"$f":"ROW()","v":252},4,{"$f":"_xlfn.XLOOKUP(B252,AUX!$A:$A,AUX!$B:$B,\"\",0,1)","v":"BLACK"},{"$f":"IF(C252=0,INDEX($C:$C,MAX(_xlfn.XLOOKUP(\"BLACK\",$C$7:C252,$A$7:A252,\"\",0,-1),_xlfn.XLOOKUP(\"RED\",$C$7:C252,$A$7:A252,\"\",0,-1)),1),C252)","v":"BLACK"},{"$f":"IF(AND(COUNTIF($D$7:D252,\"RED\")>0,COUNTIF($D$7:D252,\"BLACK\")>0),A252-MIN(_xlfn.XLOOKUP(\"BLACK\",$D$7:D252,$A$7:A252,\"\",0,-1),_xlfn.XLOOKUP(\"RED\",$D$7:D252,$A$7:A252,\"\",0,-1)),A252-6)","v":1},"","","","","",270,"",50,1]
[{"$f":"ROW()","v":253},13,{"$f":"_xlfn.XLOOKUP(B253,AUX!$A:$A,AUX!$B:$B,\"\",0,1)","v":"RED"},{"$f":"IF(C253=0,INDEX($C:$C,MAX(_xlfn.XLOOKUP(\"BLACK\",$C$7:C253,$A$7:A253,\"\",0,-1),_xlfn.XLOOKUP(\"RED\",$C$7:C253,$A$7:A253,\"\",0,-1)),1),C253)","v":"RED"},{"$f":"IF(AND(COUNTIF($D$7:D253,\"RED\")>0,COUNTIF($D$7:D253,\"BLACK\")>0),A253-MIN(_xlfn.XLOOKUP(\"BLACK\",$D$7:D253,$A$7:A253,\"\",0,-1),_xlfn.XLOOKUP(\"RED\",$D$7:D253,$A$7:A253,\"\",0,-1)),A253-6)","v":1},"BET","RED","SUCCESS",5,10,275,"",50,""]
[{"$f":"ROW()","v":254},33,{"$f":"_xlfn.XLOOKUP(B254,AUX!$A:$A,AUX!$B:$B,\"\",0,1)","v":"RED"},{"$f":"IF(C254=0,INDEX($C:$C,MAX(_xlfn.XLOOKUP(\"BLACK\",$C$7:C254,$A$7:A254,\"\",0,-1),_xlfn.XLOOKUP(\"RED\",$C$7:C254,$A$7:A254,\"\",0,-1)),1),C254)","v":"RED"},{"$f":"IF(AND(COUNTIF($D$7:D254,\"RED\")>0,COUNTIF($D$7:D254,\"BLACK\")>0),A254-MIN(_xlfn.XLOOKUP(\"BLACK\",$D$7:D254,$A$7:A254,\"\",0,-1),_xlfn.XLOOKUP(\"RED\",$D$7:D254,$A$7:A254,\"\",0,-1)),A254-6)","v":2},"BET","BLACK","FAIL",5,0,270,"STOP",100,2]
[{"$f":"ROW()","v":255},24,{"$f":"_xlfn.XLOOKUP(B255,AUX!$A:$A,AUX!$B:$B,\"\",0,1)","v":"BLACK"},{"$f":"IF(C255=0,INDEX($C:$C,MAX(_xlfn.XLOOKUP(\"BLACK\",$C$7:C255,$A$7:A255,\"\",0,-1),_xlfn.XLOOKUP(\"RED\",$C$7:C255,$A$7:A255,\"\",0,-1)),1),C255)","v":"BLACK"},{"$f":"IF(AND(COUNTIF($D$7:D255,\"RED\")>0,COUNTIF($D$7:D255,\"BLACK\")>0),A255-MIN(_xlfn.XLOOKUP(\"BLACK\",$D$7:D255,$A$7:A255,\"\",0,-1),_xlfn.XLOOKUP(\"RED\",$D$7:D255,$A$7:A255,\"\",0,-1)),A255-6)","v":1},"","","","","",270,"",50,""]
[{"$f":"ROW()","v":256},34,{"$f":"_xlfn.XLOOKUP(B256,AUX!$A:$A,AUX!$B:$B,\"\",0,1)","v":"BLACK"},{"$f":"IF(C256=0,INDEX($C:$C,MAX(_xlfn.XLOOKUP(\"BLACK\",$C$7:C256,$A$7:A256,\"\",0,-1),_xlfn.XLOOKUP(\"RED\",$C$7:C256,$A$7:A256,\"\",0,-1)),1),C256)","v":"BLACK"},{"$f":"IF(AND(COUNTIF($D$7:D256,\"RED\")>0,COUNTIF($D$7:D256,\"BLACK\")>0),A256-MIN(_xlfn.XLOOKUP(\"BLACK\",$D$7:D256,$A$7:A256,\"\",0,-1),_xlfn.XLOOKUP(\"RED\",$D$7:D256,$A$7:A256,\"\",0,-1)),A256-6)","v":2},"BET","RED","FAIL",5,0,265,"STOP",100,2]
[{"$f":"ROW()","v":257},25,{"$f":"_xlfn.XLOOKUP(B257,AUX!$A:$A,AUX!$B:$B,\"\",0,1)","v":"RED"},{"$f":"IF(C257=0,INDEX($C:$C,MAX(_xlfn.XLOOKUP(\"BLACK\",$C$7:C257,$A$7:A257,\"\",0,-1),_xlfn.XLOOKUP(\"RED\",$C$7:C257,$A$7:A257,\"\",0,-1)),1),C257)","v":"RED"},{"$f":"IF(AND(COUNTIF($D$7:D257,\"RED\")>0,COUNTIF($D$7:D257,\"BLACK\")>0),A257-MIN(_xlfn.XLOOKUP(\"BLACK\",$D$7:D257,$A$7:A257,\"\",0,-1),_xlfn.XLOOKUP(\"RED\",$D$7:D257,$A$7:A257,\"\",0,-1)),A257-6)","v":1},"","","","","",265,"",50,1]
[{"$f":"ROW()","v":258},22,{"$f":"_xlfn.XLOOKUP(B258,AUX!$A:$A,AUX!$B:$B,\"\",0,1)","v":"BLACK"},{"$f":"IF(C258=0,INDEX($C:$C,MAX(_xlfn.XLOOKUP(\"BLACK\",$C$7:C258,$A$7:A258,\"\",0,-1),_xlfn.XLOOKUP(\"RED\",$C$7:C258,$A$7:A258,\"\",0,-1)),1),C258)","v":"BLACK"},{"$f":"IF(AND(COUNTIF($D$7:D258,\"RED\")>0,COUNTIF($D$7:D258,\"BLACK\")>0),A258-MIN(_xlfn.XLOOKUP(\"BLACK\",$D$7:D258,$A$7:A258,\"\",0,-1),_xlfn.XLOOKUP(\"RED\",$D$7:D258,$A$7:A258,\"\",0,-1)),A258-6)","v":1},"BET","BLACK","SUCCESS",5,10,270,"",50,""]
[{"$f":"ROW()","v":259},30,{"$f":"_xlfn.XLOOKUP(B259,AUX!$A:$A,AUX!$B:$B,\"\",0,1)","v":"BLACK"},{"$f":"IF(C259=0,INDEX($C:$C,MAX(_xlfn.XLOOKUP(\"BLACK\",$C$7:C259,$A$7:A259,\"\",0,-1),_xlfn.XLOOKUP(\"RED\",$C$7:C259,$A$7:A259,\"\",0,-1)),1),C259)","v":"BLACK"},{"$f":"IF(AND(COUNTIF($D$7:D259,\"RED\")>0,COUNTIF($D$7:D259,\"BLACK\")>0),A259-MIN(_xlfn.XLOOKUP(\"BLACK\",$D$7:D259,$A$7:A259,\"\",0,-1),_xlfn.XLOOKUP(\"RED\",$D$7:D259,$A$7:A259,\"\",0,-1)),A259-6)","v":2},"BET","RED","FAIL",5,0,265,"STOP",100,""]
[{"$f":"ROW()","v":260},34,{"$f":"_xlfn.XLOOKUP(B260,AUX!$A:$A,AUX!$B:$B,\"\",0,1)","v":"BLACK"},{"$f":"IF(C260=0,INDEX($C:$C,MAX(_xlfn.XLOOKUP(\"BLACK\",$C$7:C260,$A$7:A260,\"\",0,-1),_xlfn.XLOOKUP(\"RED\",$C$7:C260,$A$7:A260,\"\",0,-1)),1),C260)","v":"BLACK"},{"$f":"IF(AND(COUNTIF($D$7:D260,\"RED\")>0,COUNTIF($D$7:D260,\"BLACK\")>0),A260-MIN(_xlfn.XLOOKUP(\"BLACK\",$D$7:D260,$A$7:A260,\"\",0,-1),_xlfn.XLOOKUP(\"RED\",$D$7:D260,$A$7:A260,\"\",0,-1)),A260-6)","v":3},"","","","","",265,"STOP",150,""]
[{"$f":"ROW()","v":261},4,{"$f":"_xlfn.XLOOKUP(B261,AUX!$A:$A,AUX!$B:$B,\"\",0,1)","v":"BLACK"},{"$f":"IF(C261=0,INDEX($C:$C,MAX(_xlfn.XLOOKUP(\"BLACK\",$C$7:C261,$A$7:A261,\"\",0,-1),_xlfn.XLOOKUP(\"RED\",$C$7:C261,$A$7:A261,\"\",0,-1)),1),C261)","v":"BLACK"},{"$f":"IF(AND(COUNTIF($D$7:D261,\"RED\")>0,COUNTIF($D$7:D261,\"BLACK\")>0),A261-MIN(_xlfn.XLOOKUP(\"BLACK\",$D$7:D261,$A$7:A261,\"\",0,-1),_xlfn.XLOOKUP(\"RED\",$D$7:D261,$A$7:A261,\"\",0,-1)),A261-6)","v":4},"","","","","",265,"STOP",200,4]
[{"$f":"ROW()","v":262},31,{"$f":"_xlfn.XLOOKUP(B262,AUX!$A:$A,AUX!$B:$B,\"\",0,1)","v":"RED"},{"$f":"IF(C262=0,INDEX($C:$C,MAX(_xlfn.XLOOKUP(\"BLACK\",$C$7:C262,$A$7:A262,\"\",0,-1),_xlfn.XLOOKUP(\"RED\",$C$7:C262,$A$7:A262,\"\",0,-1)),1),C262)","v":"RED"},{"$f":"IF(AND(COUNTIF($D$7:D262,\"RED\")>0,COUNTIF($D$7:D262,\"BLACK\")>0),A262-MIN(_xlfn.XLOOKUP(\"BLACK\",$D$7:D262,$A$7:A262,\"\",0,-1),_xlfn.XLOOKUP(\"RED\",$D$7:D262,$A$7:A262,\"\",0,-1)),A262-6)","v":1},"","","","","",265,"",50,""]
[{"$f":"ROW()","v":263},0,{"$f":"_xlfn.XLOOKUP(B263,AUX!$A:$A,AUX!$B:$B,\"\",0,1)","v":0},{"$f":"IF(C263=0,INDEX($C:$C,MAX(_xlfn.XLOOKUP(\"BLACK\",$C$7:C263,$A$7:A263,\"\",0,-1),_xlfn.XLOOKUP(\"RED\",$C$7:C263,$A$7:A263,\"\",0,-1)),1),C263)","v":"RED"},{"$f":"IF(AND(COUNTIF($D$7:D263,\"RED\")>0,COUNTIF($D$7:D263,\"BLACK\")>0),A263-MIN(_xlfn.XLOOKUP(\"BLACK\",$D$7:D263,$A$7:A263,\"\",0,-1),_xlfn.XLOOKUP(\"RED\",$D$7:D263,$A$7:A263,\"\",0,-1)),A263-6)","v":2},"BET","BLACK","FAIL",5,0,260,"STOP",100,2]
[{"$f":"ROW()","v":264},{"$f":"RANDBETWEEN(0,36)","v":32},{"$f":"_xlfn.XLOOKUP(B264,AUX!$A:$A,AUX!$B:$B,\"\",0,1)","v":"BLACK"},{"$f":"IF(C264=0,INDEX($C:$C,MAX(_xlfn.XLOOKUP(\"BLACK\",$C$7:C264,$A$7:A264,\"\",0,-1),_xlfn.XLOOKUP(\"RED\",$C$7:C264,$A$7:A264,\"\",0,-1)),1),C264)","v":"BLACK"},{"$f":"IF(AND(COUNTIF($D$7:D264,\"RED\")>0,COUNTIF($D$7:D264,\"BLACK\")>0),A264-MIN(_xlfn.XLOOKUP(\"BLACK\",$D$7:D264,$A$7:A264,\"\",0,-1),_xlfn.XLOOKUP(\"RED\",$D$7:D264,$A$7:A264,\"\",0,-1)),A264-6)","v":1},"","","","","",260,{"$f":"IF(OR(AND(H264=\"FAIL\",I264=$G$4),AND(L263=\"STOP\",E264>$E$3)),\"STOP\",\"\")","v":""},50,{"$f":"IF(E265<=E264,E264,\"\")","v":1}]
[{"$f":"ROW()","v":265},7,{"$f":"_xlfn.XLOOKUP(B265,AUX!$A:$A,AUX!$B:$B,\"\",0,1)","v":"RED"},{"$f":"IF(C265=0,INDEX($C:$C,MAX(_xlfn.XLOOKUP(\"BLACK\",$C$7:C265,$A$7:A265,\"\",0,-1),_xlfn.XLOOKUP(\"RED\",$C$7:C265,$A$7:A265,\"\",0,-1)),1),C265)","v":"RED"},{"$f":"IF(AND(COUNTIF($D$7:D265,\"RED\")>0,COUNTIF($D$7:D265,\"BLACK\")>0),A265-MIN(_xlfn.XLOOKUP(\"BLACK\",$D$7:D265,$A$7:A265,\"\",0,-1),_xlfn.XLOOKUP(\"RED\",$D$7:D265,$A$7:A265,\"\",0,-1)),A265-6)","v":1},"BET","RED","SUCCESS",5,10,265,"",50,""]
[{"$f":"ROW()","v":266},35,{"$f":"_xlfn.XLOOKUP(B266,AUX!$A:$A,AUX!$B:$B,\"\",0,1)","v":"RED"},{"$f":"IF(C266=0,INDEX($C:$C,MAX(_xlfn.XLOOKUP(\"BLACK\",$C$7:C266,$A$7:A266,\"\",0,-1),_xlfn.XLOOKUP(\"RED\",$C$7:C266,$A$7:A266,\"\",0,-1)),1),C266)","v":"RED"},{"$f":"IF(AND(COUNTIF($D$7:D266,\"RED\")>0,COUNTIF($D$7:D266,\"BLACK\")>0),A266-MIN(_xlfn.XLOOKUP(\"BLACK\",$D$7:D266,$A$7:A266,\"\",0,-1),_xlfn.XLOOKUP(\"RED\",$D$7:D266,$A$7:A266,\"\",0,-1)),A266-6)","v":2},"BET","BLACK","FAIL",5,0,260,"STOP",100,2]
[{"$f":"ROW()","v":267},30,{"$f":"_xlfn.XLOOKUP(B267,AUX!$A:$A,AUX!$B:$B,\"\",0,1)","v":"BLACK"},{"$f":"IF(C267=0,INDEX($C:$C,MAX(_xlfn.XLOOKUP(\"BLACK\",$C$7:C267,$A$7:A267,\"\",0,-1),_xlfn.XLOOKUP(\"RED\",$C$7:C267,$A$7:A267,\"\",0,-1)),1),C267)","v":"BLACK"},{"$f":"IF(AND(COUNTIF($D$7:D267,\"RED\")>0,COUNTIF($D$7:D267,\"BLACK\")>0),A267-MIN(_xlfn.XLOOKUP(\"BLACK\",$D$7:D267,$A$7:A267,\"\",0,-1),_xlfn.XLOOKUP(\"RED\",$D$7:D267,$A$7:A267,\"\",0,-1)),A267-6)","v":1},"","","","","",260,"",50,""]
[{"$f":"ROW()","v":268},8,{"$f":"_xlfn.XLOOKUP(B268,AUX!$A:$A,AUX!$B:$B,\"\",0,1)","v":"BLACK"},{"$f":"IF(C268=0,INDEX($C:$C,MAX(_xlfn.XLOOKUP(\"BLACK\",$C$7:C268,$A$7:A268,\"\",0,-1),_xlfn.XLOOKUP(\"RED\",$C$7:C268,$A$7:A268,\"\",0,-1)),1),C268)","v":"BLACK"},{"$f":"IF(AND(COUNTIF($D$7:D268,\"RED\")>0,COUNTIF($D$7:D268,\"BLACK\")>0),A268-MIN(_xlfn.XLOOKUP(\"BLACK\",$D$7:D268,$A$7:A268,\"\",0,-1),_xlfn.XLOOKUP(\"RED\",$D$7:D268,$A$7:A268,\"\",0,-1)),A268-6)","v":2},"BET","RED","FAIL",5,0,255,"STOP",100,2]
[{"$f":"ROW()","v":269},31,{"$f":"_xlfn.XLOOKUP(B269,AUX!$A:$A,AUX!$B:$B,\"\",0,1)","v":"RED"},{"$f":"IF(C269=0,INDEX($C:$C,MAX(_xlfn.XLOOKUP(\"BLACK\",$C$7:C269,$A$7:A269,\"\",0,-1),_xlfn.XLOOKUP(\"RED\",$C$7:C269,$A$7:A269,\"\",0,-1)),1),C269)","v":"RED"},{"$f":"IF(AND(COUNTIF($D$7:D269,\"RED\")>0,COUNTIF($D$7:D269,\"BLACK\")>0),A269-MIN(_xlfn.XLOOKUP(\"BLACK\",$D$7:D269,$A$7:A269,\"\",0,-1),_xlfn.XLOOKUP(\"RED\",$D$7:D269,$A$7:A269,\"\",0,-1)),A269-6)","v":1},"","","","","",255,"",50,""]
[{"$f":"ROW()","v":270},5,{"$f":"_xlfn.XLOOKUP(B270,AUX!$A:$A,AUX!$B:$B,\"\",0,1)","v":"RED"},{"$f":"IF(C270=0,INDEX($C:$C,MAX(_xlfn.XLOOKUP(\"BLACK\",$C$7:C270,$A$7:A270,\"\",0,-1),_xlfn.XLOOKUP(\"RED\",$C$7:C270,$A$7:A270,\"\",0,-1)),1),C270)","v":"RED"},{"$f":"IF(AND(COUNTIF($D$7:D270,\"RED\")>0,COUNTIF($D$7:D270,\"BLACK\")>0),A270-MIN(_xlfn.XLOOKUP(\"BLACK\",$D$7:D270,$A$7:A270,\"\",0,-1),_xlfn.XLOOKUP(\"RED\",$D$7:D270,$A$7:A270,\"\",0,-1)),A270-6)","v":2},"BET","BLACK","FAIL",5,0,250,"STOP",100,""]
[{"$f":"ROW()","v":271},13,{"$f":"_xlfn.XLOOKUP(B271,AUX!$A:$A,AUX!$B:$B,\"\",0,1)","v":"RED"},{"$f":"IF(C271=0,INDEX($C:$C,MAX(_xlfn.XLOOKUP(\"BLACK\",$C$7:C271,$A$7:A271,\"\",0,-1),_xlfn.XLOOKUP(\"RED\",$C$7:C271,$A$7:A271,\"\",0,-1)),1),C271)","v":"RED"},{"$f":"IF(AND(COUNTIF($D$7:D271,\"RED\")>0,COUNTIF($D$7:D271,\"BLACK\")>0),A271-MIN(_xlfn.XLOOKUP(\"BLACK\",$D$7:D271,$A$7:A271,\"\",0,-1),_xlfn.XLOOKUP(\"RED\",$D$7:D271,$A$7:A271,\"\",0,-1)),A271-6)","v":3},"","","","","",250,"STOP",150,3]
[{"$f":"ROW()","v":272},22,{"$f":"_xlfn.XLOOKUP(B272,AUX!$A:$A,AUX!$B:$B,\"\",0,1)","v":"BLACK"},{"$f":"IF(C272=0,INDEX($C:$C,MAX(_xlfn.XLOOKUP(\"BLACK\",$C$7:C272,$A$7:A272,\"\",0,-1),_xlfn.XLOOKUP(\"RED\",$C$7:C272,$A$7:A272,\"\",0,-1)),1),C272)","v":"BLACK"},{"$f":"IF(AND(COUNTIF($D$7:D272,\"RED\")>0,COUNTIF($D$7:D272,\"BLACK\")>0),A272-MIN(_xlfn.XLOOKUP(\"BLACK\",$D$7:D272,$A$7:A272,\"\",0,-1),_xlfn.XLOOKUP(\"RED\",$D$7:D272,$A$7:A272,\"\",0,-1)),A272-6)","v":1},"","","","","",250,"",50,1]
[{"$f":"ROW()","v":273},9,{"$f":"_xlfn.XLOOKUP(B273,AUX!$A:$A,AUX!$B:$B,\"\",0,1)","v":"RED"},{"$f":"IF(C273=0,INDEX($C:$C,MAX(_xlfn.XLOOKUP(\"BLACK\",$C$7:C273,$A$7:A273,\"\",0,-1),_xlfn.XLOOKUP(\"RED\",$C$7:C273,$A$7:A273,\"\",0,-1)),1),C273)","v":"RED"},{"$f":"IF(AND(COUNTIF($D$7:D273,\"RED\")>0,COUNTIF($D$7:D273,\"BLACK\")>0),A273-MIN(_xlfn.XLOOKUP(\"BLACK\",$D$7:D273,$A$7:A273,\"\",0,-1),_xlfn.XLOOKUP(\"RED\",$D$7:D273,$A$7:A273,\"\",0,-1)),A273-6)","v":1},"BET","RED","SUCCESS",5,10,255,"",50,1]
[{"$f":"ROW()","v":274},36,{"$f":"_xlfn.XLOOKUP(B274,AUX!$A:$A,AUX!$B:$B,\"\",0,1)","v":"BLACK"},{"$f":"IF(C274=0,INDEX($C:$C,MAX(_xlfn.XLOOKUP(\"BLACK\",$C$7:C274,$A$7:A274,\"\",0,-1),_xlfn.XLOOKUP(\"RED\",$C$7:C274,$A$7:A274,\"\",0,-1)),1),C274)","v":"BLACK"},{"$f":"IF(AND(COUNTIF($D$7:D274,\"RED\")>0,COUNTIF($D$7:D274,\"BLACK\")>0),A274-MIN(_xlfn.XLOOKUP(\"BLACK\",$D$7:D274,$A$7:A274,\"\",0,-1),_xlfn.XLOOKUP(\"RED\",$D$7:D274,$A$7:A274,\"\",0,-1)),A274-6)","v":1},"BET","BLACK","SUCCESS",5,10,260,"",50,1]
[{"$f":"ROW()","v":275},17,{"$f":"_xlfn.XLOOKUP(B275,AUX!$A:$A,AUX!$B:$B,\"\",0,1)","v":"RED"},{"$f":"IF(C275=0,INDEX($C:$C,MAX(_xlfn.XLOOKUP(\"BLACK\",$C$7:C275,$A$7:A275,\"\",0,-1),_xlfn.XLOOKUP(\"RED\",$C$7:C275,$A$7:A275,\"\",0,-1)),1),C275)","v":"RED"},{"$f":"IF(AND(COUNTIF($D$7:D275,\"RED\")>0,COUNTIF($D$7:D275,\"BLACK\")>0),A275-MIN(_xlfn.XLOOKUP(\"BLACK\",$D$7:D275,$A$7:A275,\"\",0,-1),_xlfn.XLOOKUP(\"RED\",$D$7:D275,$A$7:A275,\"\",0,-1)),A275-6)","v":1},"BET","RED","SUCCESS",5,10,265,"",50,1]
[{"$f":"ROW()","v":276},16,{"$f":"_xlfn.XLOOKUP(B276,AUX!$A:$A,AUX!$B:$B,\"\",0,1)","v":"BLACK"},{"$f":"IF(C276=0,INDEX($C:$C,MAX(_xlfn.XLOOKUP(\"BLACK\",$C$7:C276,$A$7:A276,\"\",0,-1),_xlfn.XLOOKUP(\"RED\",$C$7:C276,$A$7:A276,\"\",0,-1)),1),C276)","v":"BLACK"},{"$f":"IF(AND(COUNTIF($D$7:D276,\"RED\")>0,COUNTIF($D$7:D276,\"BLACK\")>0),A276-MIN(_xlfn.XLOOKUP(\"BLACK\",$D$7:D276,$A$7:A276,\"\",0,-1),_xlfn.XLOOKUP(\"RED\",$D$7:D276,$A$7:A276,\"\",0,-1)),A276-6)","v":1},"BET","BLACK","SUCCESS",5,10,270,"",50,""]
[{"$f":"ROW()","v":277},36,{"$f":"_xlfn.XLOOKUP(B277,AUX!$A:$A,AUX!$B:$B,\"\",0,1)","v":"BLACK"},{"$f":"IF(C277=0,INDEX($C:$C,MAX(_xlfn.XLOOKUP(\"BLACK\",$C$7:C277,$A$7:A277,\"\",0,-1),_xlfn.XLOOKUP(\"RED\",$C$7:C277,$A$7:A277,\"\",0,-1)),1),C277)","v":"BLACK"},{"$f":"IF(AND(COUNTIF($D$7:D277,\"RED\")>0,COUNTIF($D$7:D277,\"BLACK\")>0),A277-MIN(_xlfn.XLOOKUP(\"BLACK\",$D$7:D277,$A$7:A277,\"\",0,-1),_xlfn.XLOOKUP(\"RED\",$D$7:D277,$A$7:A277,\"\",0,-1)),A277-6)","v":2},"BET","RED","FAIL",5,0,265,"STOP",100,""]
[{"$f":"ROW()","v":278},4,{"$f":"_xlfn.XLOOKUP(B278,AUX!$A:$A,AUX!$B:$B,\"\",0,1)","v":"BLACK"},{"$f":"IF(C278=0,INDEX($C:$C,MAX(_xlfn.XLOOKUP(\"BLACK\",$C$7:C278,$A$7:A278,\"\",0,-1),_xlfn.XLOOKUP(\"RED\",$C$7:C278,$A$7:A278,\"\",0,-1)),1),C278)","v":"BLACK"},{"$f":"IF(AND(COUNTIF($D$7:D278,\"RED\")>0,COUNTIF($D$7:D278,\"BLACK\")>0),A278-MIN(_xlfn.XLOOKUP(\"BLACK\",$D$7:D278,$A$7:A278,\"\",0,-1),_xlfn.XLOOKUP(\"RED\",$D$7:D278,$A$7:A278,\"\",0,-1)),A278-6)","v":3},"","","","","",265,"STOP",150,""]
[{"$f":"ROW()","v":279},18,{"$f":"_xlfn.XLOOKUP(B279,AUX!$A:$A,AUX!$B:$B,\"\",0,1)","v":"BLACK"},{"$f":"IF(C279=0,INDEX($C:$C,MAX(_xlfn.XLOOKUP(\"BLACK\",$C$7:C279,$A$7:A279,\"\",0,-1),_xlfn.XLOOKUP(\"RED\",$C$7:C279,$A$7:A279,\"\",0,-1)),1),C279)","v":"BLACK"},{"$f":"IF(AND(COUNTIF($D$7:D279,\"RED\")>0,COUNTIF($D$7:D279,\"BLACK\")>0),A279-MIN(_xlfn.XLOOKUP(\"BLACK\",$D$7:D279,$A$7:A279,\"\",0,-1),_xlfn.XLOOKUP(\"RED\",$D$7:D279,$A$7:A279,\"\",0,-1)),A279-6)","v":4},"","","","","",265,"STOP",200,""]
[{"$f":"ROW()","v":280},18,{"$f":"_xlfn.XLOOKUP(B280,AUX!$A:$A,AUX!$B:$B,\"\",0,1)","v":"BLACK"},{"$f":"IF(C280=0,INDEX($C:$C,MAX(_xlfn.XLOOKUP(\"BLACK\",$C$7:C280,$A$7:A280,\"\",0,-1),_xlfn.XLOOKUP(\"RED\",$C$7:C280,$A$7:A280,\"\",0,-1)),1),C280)","v":"BLACK"},{"$f":"IF(AND(COUNTIF($D$7:D280,\"RED\")>0,COUNTIF($D$7:D280,\"BLACK\")>0),A280-MIN(_xlfn.XLOOKUP(\"BLACK\",$D$7:D280,$A$7:A280,\"\",0,-1),_xlfn.XLOOKUP(\"RED\",$D$7:D280,$A$7:A280,\"\",0,-1)),A280-6)","v":5},"","","","","",265,"STOP",250,""]
[{"$f":"ROW()","v":281},10,{"$f":"_xlfn.XLOOKUP(B281,AUX!$A:$A,AUX!$B:$B,\"\",0,1)","v":"BLACK"},{"$f":"IF(C281=0,INDEX($C:$C,MAX(_xlfn.XLOOKUP(\"BLACK\",$C$7:C281,$A$7:A281,\"\",0,-1),_xlfn.XLOOKUP(\"RED\",$C$7:C281,$A$7:A281,\"\",0,-1)),1),C281)","v":"BLACK"},{"$f":"IF(AND(COUNTIF($D$7:D281,\"RED\")>0,COUNTIF($D$7:D281,\"BLACK\")>0),A281-MIN(_xlfn.XLOOKUP(\"BLACK\",$D$7:D281,$A$7:A281,\"\",0,-1),_xlfn.XLOOKUP(\"RED\",$D$7:D281,$A$7:A281,\"\",0,-1)),A281-6)","v":6},"","","","","",265,"STOP",300,""]
[{"$f":"ROW()","v":282},20,{"$f":"_xlfn.XLOOKUP(B282,AUX!$A:$A,AUX!$B:$B,\"\",0,1)","v":"BLACK"},{"$f":"IF(C282=0,INDEX($C:$C,MAX(_xlfn.XLOOKUP(\"BLACK\",$C$7:C282,$A$7:A282,\"\",0,-1),_xlfn.XLOOKUP(\"RED\",$C$7:C282,$A$7:A282,\"\",0,-1)),1),C282)","v":"BLACK"},{"$f":"IF(AND(COUNTIF($D$7:D282,\"RED\")>0,COUNTIF($D$7:D282,\"BLACK\")>0),A282-MIN(_xlfn.XLOOKUP(\"BLACK\",$D$7:D282,$A$7:A282,\"\",0,-1),_xlfn.XLOOKUP(\"RED\",$D$7:D282,$A$7:A282,\"\",0,-1)),A282-6)","v":7},"","","","","",265,"STOP",350,""]
[{"$f":"ROW()","v":283},32,{"$f":"_xlfn.XLOOKUP(B283,AUX!$A:$A,AUX!$B:$B,\"\",0,1)","v":"BLACK"},{"$f":"IF(C283=0,INDEX($C:$C,MAX(_xlfn.XLOOKUP(\"BLACK\",$C$7:C283,$A$7:A283,\"\",0,-1),_xlfn.XLOOKUP(\"RED\",$C$7:C283,$A$7:A283,\"\",0,-1)),1),C283)","v":"BLACK"},{"$f":"IF(AND(COUNTIF($D$7:D283,\"RED\")>0,COUNTIF($D$7:D283,\"BLACK\")>0),A283-MIN(_xlfn.XLOOKUP(\"BLACK\",$D$7:D283,$A$7:A283,\"\",0,-1),_xlfn.XLOOKUP(\"RED\",$D$7:D283,$A$7:A283,\"\",0,-1)),A283-6)","v":8},"","","","","",265,"STOP",400,""]
[{"$f":"ROW()","v":284},2,{"$f":"_xlfn.XLOOKUP(B284,AUX!$A:$A,AUX!$B:$B,\"\",0,1)","v":"BLACK"},{"$f":"IF(C284=0,INDEX($C:$C,MAX(_xlfn.XLOOKUP(\"BLACK\",$C$7:C284,$A$7:A284,\"\",0,-1),_xlfn.XLOOKUP(\"RED\",$C$7:C284,$A$7:A284,\"\",0,-1)),1),C284)","v":"BLACK"},{"$f":"IF(AND(COUNTIF($D$7:D284,\"RED\")>0,COUNTIF($D$7:D284,\"BLACK\")>0),A284-MIN(_xlfn.XLOOKUP(\"BLACK\",$D$7:D284,$A$7:A284,\"\",0,-1),_xlfn.XLOOKUP(\"RED\",$D$7:D284,$A$7:A284,\"\",0,-1)),A284-6)","v":9},"","","","","",265,"STOP",450,9]
[{"$f":"ROW()","v":285},29,{"$f":"_xlfn.XLOOKUP(B285,AUX!$A:$A,AUX!$B:$B,\"\",0,1)","v":"RED"},{"$f":"IF(C285=0,INDEX($C:$C,MAX(_xlfn.XLOOKUP(\"BLACK\",$C$7:C285,$A$7:A285,\"\",0,-1),_xlfn.XLOOKUP(\"RED\",$C$7:C285,$A$7:A285,\"\",0,-1)),1),C285)","v":"RED"},{"$f":"IF(AND(COUNTIF($D$7:D285,\"RED\")>0,COUNTIF($D$7:D285,\"BLACK\")>0),A285-MIN(_xlfn.XLOOKUP(\"BLACK\",$D$7:D285,$A$7:A285,\"\",0,-1),_xlfn.XLOOKUP(\"RED\",$D$7:D285,$A$7:A285,\"\",0,-1)),A285-6)","v":1},{"$f":"IF(AND(E284>=$E$3,L284=\"\"),\"BET\",\"\")","v":""},{"$f":"IF(F285=\"BET\",IF(D284=\"RED\",\"BLACK\",IF(D284=\"BLACK\",\"RED\",\"ERROR\")),\"\")","v":""},{"$f":"IF(F285=\"BET\",IF(D285=G285,\"SUCCESS\",\"FAIL\"),\"\")","v":""},{"$f":"IF(F285=\"BET\",IF(OR(I284>=$G$4,F284=\"\"),$F$3,IF(AND(F284=\"BET\",H284=\"FAIL\"),I284*2,$F$3)),\"\")","v":""},{"$f":"IF(F285=\"BET\",IF(H285=\"SUCCESS\",I285*2,0),\"\")","v":""},{"$f":"IF(F285=\"BET\",K284-I285+J285,K284)","v":265},"",{"$f":"E285*50","v":50},""]
[{"$f":"ROW()","v":286},33,{"$f":"_xlfn.XLOOKUP(B286,AUX!$A:$A,AUX!$B:$B,\"\",0,1)","v":"RED"},{"$f":"IF(C286=0,INDEX($C:$C,MAX(_xlfn.XLOOKUP(\"BLACK\",$C$7:C286,$A$7:A286,\"\",0,-1),_xlfn.XLOOKUP(\"RED\",$C$7:C286,$A$7:A286,\"\",0,-1)),1),C286)","v":"RED"},{"$f":"IF(AND(COUNTIF($D$7:D286,\"RED\")>0,COUNTIF($D$7:D286,\"BLACK\")>0),A286-MIN(_xlfn.XLOOKUP(\"BLACK\",$D$7:D286,$A$7:A286,\"\",0,-1),_xlfn.XLOOKUP(\"RED\",$D$7:D286,$A$7:A286,\"\",0,-1)),A286-6)","v":2},"BET","BLACK","FAIL",5,0,260,"STOP",100,2]
[{"$f":"ROW()","v":287},4,{"$f":"_xlfn.XLOOKUP(B287,AUX!$A:$A,AUX!$B:$B,\"\",0,1)","v":"BLACK"},{"$f":"IF(C287=0,INDEX($C:$C,MAX(_xlfn.XLOOKUP(\"BLACK\",$C$7:C287,$A$7:A287,\"\",0,-1),_xlfn.XLOOKUP(\"RED\",$C$7:C287,$A$7:A287,\"\",0,-1)),1),C287)","v":"BLACK"},{"$f":"IF(AND(COUNTIF($D$7:D287,\"RED\")>0,COUNTIF($D$7:D287,\"BLACK\")>0),A287-MIN(_xlfn.XLOOKUP(\"BLACK\",$D$7:D287,$A$7:A287,\"\",0,-1),_xlfn.XLOOKUP(\"RED\",$D$7:D287,$A$7:A287,\"\",0,-1)),A287-6)","v":1},"","","","","",260,"",50,1]
[{"$f":"ROW()","v":288},5,{"$f":"_xlfn.XLOOKUP(B288,AUX!$A:$A,AUX!$B:$B,\"\",0,1)","v":"RED"},{"$f":"IF(C288=0,INDEX($C:$C,MAX(_xlfn.XLOOKUP(\"BLACK\",$C$7:C288,$A$7:A288,\"\",0,-1),_xlfn.XLOOKUP(\"RED\",$C$7:C288,$A$7:A288,\"\",0,-1)),1),C288)","v":"RED"},{"$f":"IF(AND(COUNTIF($D$7:D288,\"RED\")>0,COUNTIF($D$7:D288,\"BLACK\")>0),A288-MIN(_xlfn.XLOOKUP(\"BLACK\",$D$7:D288,$A$7:A288,\"\",0,-1),_xlfn.XLOOKUP(\"RED\",$D$7:D288,$A$7:A288,\"\",0,-1)),A288-6)","v":1},"BET","RED","SUCCESS",5,10,265,"",50,1]
[{"$f":"ROW()","v":289},4,{"$f":"_xlfn.XLOOKUP(B289,AUX!$A:$A,AUX!$B:$B,\"\",0,1)","v":"BLACK"},{"$f":"IF(C289=0,INDEX($C:$C,MAX(_xlfn.XLOOKUP(\"BLACK\",$C$7:C289,$A$7:A289,\"\",0,-1),_xlfn.XLOOKUP(\"RED\",$C$7:C289,$A$7:A289,\"\",0,-1)),1),C289)","v":"BLACK"},{"$f":"IF(AND(COUNTIF($D$7:D289,\"RED\")>0,COUNTIF($D$7:D289,\"BLACK\")>0),A289-MIN(_xlfn.XLOOKUP(\"BLACK\",$D$7:D289,$A$7:A289,\"\",0,-1),_xlfn.XLOOKUP(\"RED\",$D$7:D289,$A$7:A289,\"\",0,-1)),A289-6)","v":1},"BET","BLACK","SUCCESS",5,10,270,"",50,""]
[{"$f":"ROW()","v":290},20,{"$f":"_xlfn.XLOOKUP(B290,AUX!$A:$A,AUX!$B:$B,\"\",0,1)","v":"BLACK"},{"$f":"IF(C290=0,INDEX($C:$C,MAX(_xlfn.XLOOKUP(\"BLACK\",$C$7:C290,$A$7:A290,\"\",0,-1),_xlfn.XLOOKUP(\"RED\",$C$7:C290,$A$7:A290,\"\",0,-1)),1),C290)","v":"BLACK"},{"$f":"IF(AND(COUNTIF($D$7:D290,\"RED\")>0,COUNTIF($D$7:D290,\"BLACK\")>0),A290-MIN(_xlfn.XLOOKUP(\"BLACK\",$D$7:D290,$A$7:A290,\"\",0,-1),_xlfn.XLOOKUP(\"RED\",$D$7:D290,$A$7:A290,\"\",0,-1)),A290-6)","v":2},"BET","RED","FAIL",5,0,265,"STOP",100,2]
[{"$f":"ROW()","v":291},35,{"$f":"_xlfn.XLOOKUP(B291,AUX!$A:$A,AUX!$B:$B,\"\",0,1)","v":"RED"},{"$f":"IF(C291=0,INDEX($C:$C,MAX(_xlfn.XLOOKUP(\"BLACK\",$C$7:C291,$A$7:A291,\"\",0,-1),_xlfn.XLOOKUP(\"RED\",$C$7:C291,$A$7:A291,\"\",0,-1)),1),C291)","v":"RED"},{"$f":"IF(AND(COUNTIF($D$7:D291,\"RED\")>0,COUNTIF($D$7:D291,\"BLACK\")>0),A291-MIN(_xlfn.XLOOKUP(\"BLACK\",$D$7:D291,$A$7:A291,\"\",0,-1),_xlfn.XLOOKUP(\"RED\",$D$7:D291,$A$7:A291,\"\",0,-1)),A291-6)","v":1},"","","","","",265,"",50,""]
[{"$f":"ROW()","v":292},33,{"$f":"_xlfn.XLOOKUP(B292,AUX!$A:$A,AUX!$B:$B,\"\",0,1)","v":"RED"},{"$f":"IF(C292=0,INDEX($C:$C,MAX(_xlfn.XLOOKUP(\"BLACK\",$C$7:C292,$A$7:A292,\"\",0,-1),_xlfn.XLOOKUP(\"RED\",$C$7:C292,$A$7:A292,\"\",0,-1)),1),C292)","v":"RED"},{"$f":"IF(AND(COUNTIF($D$7:D292,\"RED\")>0,COUNTIF($D$7:D292,\"BLACK\")>0),A292-MIN(_xlfn.XLOOKUP(\"BLACK\",$D$7:D292,$A$7:A292,\"\",0,-1),_xlfn.XLOOKUP(\"RED\",$D$7:D292,$A$7:A292,\"\",0,-1)),A292-6)","v":2},"BET","BLACK","FAIL",5,0,260,"STOP",100,""]
[{"$f":"ROW()","v":293},1,{"$f":"_xlfn.XLOOKUP(B293,AUX!$A:$A,AUX!$B:$B,\"\",0,1)","v":"RED"},{"$f":"IF(C293=0,INDEX($C:$C,MAX(_xlfn.XLOOKUP(\"BLACK\",$C$7:C293,$A$7:A293,\"\",0,-1),_xlfn.XLOOKUP(\"RED\",$C$7:C293,$A$7:A293,\"\",0,-1)),1),C293)","v":"RED"},{"$f":"IF(AND(COUNTIF($D$7:D293,\"RED\")>0,COUNTIF($D$7:D293,\"BLACK\")>0),A293-MIN(_xlfn.XLOOKUP(\"BLACK\",$D$7:D293,$A$7:A293,\"\",0,-1),_xlfn.XLOOKUP(\"RED\",$D$7:D293,$A$7:A293,\"\",0,-1)),A293-6)","v":3},"","","","","",260,"STOP",150,3]
[{"$f":"ROW()","v":294},30,{"$f":"_xlfn.XLOOKUP(B294,AUX!$A:$A,AUX!$B:$B,\"\",0,1)","v":"BLACK"},{"$f":"IF(C294=0,INDEX($C:$C,MAX(_xlfn.XLOOKUP(\"BLACK\",$C$7:C294,$A$7:A294,\"\",0,-1),_xlfn.XLOOKUP(\"RED\",$C$7:C294,$A$7:A294,\"\",0,-1)),1),C294)","v":"BLACK"},{"$f":"IF(AND(COUNTIF($D$7:D294,\"RED\")>0,COUNTIF($D$7:D294,\"BLACK\")>0),A294-MIN(_xlfn.XLOOKUP(\"BLACK\",$D$7:D294,$A$7:A294,\"\",0,-1),_xlfn.XLOOKUP(\"RED\",$D$7:D294,$A$7:A294,\"\",0,-1)),A294-6)","v":1},"","","","","",260,"",50,""]
[{"$f":"ROW()","v":295},14,{"$f":"_xlfn.XLOOKUP(B295,AUX!$A:$A,AUX!$B:$B,\"\",0,1)","v":"BLACK"},{"$f":"IF(C295=0,INDEX($C:$C,MAX(_xlfn.XLOOKUP(\"BLACK\",$C$7:C295,$A$7:A295,\"\",0,-1),_xlfn.XLOOKUP(\"RED\",$C$7:C295,$A$7:A295,\"\",0,-1)),1),C295)","v":"BLACK"},{"$f":"IF(AND(COUNTIF($D$7:D295,\"RED\")>0,COUNTIF($D$7:D295,\"BLACK\")>0),A295-MIN(_xlfn.XLOOKUP(\"BLACK\",$D$7:D295,$A$7:A295,\"\",0,-1),_xlfn.XLOOKUP(\"RED\",$D$7:D295,$A$7:A295,\"\",0,-1)),A295-6)","v":2},"BET","RED","FAIL",5,0,255,"STOP",100,""]
[{"$f":"ROW()","v":296},12,{"$f":"_xlfn.XLOOKUP(B296,AUX!$A:$A,AUX!$B:$B,\"\",0,1)","v":"BLACK"},{"$f":"IF(C296=0,INDEX($C:$C,MAX(_xlfn.XLOOKUP(\"BLACK\",$C$7:C296,$A$7:A296,\"\",0,-1),_xlfn.XLOOKUP(\"RED\",$C$7:C296,$A$7:A296,\"\",0,-1)),1),C296)","v":"BLACK"},{"$f":"IF(AND(COUNTIF($D$7:D296,\"RED\")>0,COUNTIF($D$7:D296,\"BLACK\")>0),A296-MIN(_xlfn.XLOOKUP(\"BLACK\",$D$7:D296,$A$7:A296,\"\",0,-1),_xlfn.XLOOKUP(\"RED\",$D$7:D296,$A$7:A296,\"\",0,-1)),A296-6)","v":3},"","","","","",255,"STOP",150,""]
[{"$f":"ROW()","v":297},24,{"$f":"_xlfn.XLOOKUP(B297,AUX!$A:$A,AUX!$B:$B,\"\",0,1)","v":"BLACK"},{"$f":"IF(C297=0,INDEX($C:$C,MAX(_xlfn.XLOOKUP(\"BLACK\",$C$7:C297,$A$7:A297,\"\",0,-1),_xlfn.XLOOKUP(\"RED\",$C$7:C297,$A$7:A297,\"\",0,-1)),1),C297)","v":"BLACK"},{"$f":"IF(AND(COUNTIF($D$7:D297,\"RED\")>0,COUNTIF($D$7:D297,\"BLACK\")>0),A297-MIN(_xlfn.XLOOKUP(\"BLACK\",$D$7:D297,$A$7:A297,\"\",0,-1),_xlfn.XLOOKUP(\"RED\",$D$7:D297,$A$7:A297,\"\",0,-1)),A297-6)","v":4},"","","","","",255,"STOP",200,4]
[{"$f":"ROW()","v":298},9,{"$f":"_xlfn.XLOOKUP(B298,AUX!$A:$A,AUX!$B:$B,\"\",0,1)","v":"RED"},{"$f":"IF(C298=0,INDEX($C:$C,MAX(_xlfn.XLOOKUP(\"BLACK\",$C$7:C298,$A$7:A298,\"\",0,-1),_xlfn.XLOOKUP(\"RED\",$C$7:C298,$A$7:A298,\"\",0,-1)),1),C298)","v":"RED"},{"$f":"IF(AND(COUNTIF($D$7:D298,\"RED\")>0,COUNTIF($D$7:D298,\"BLACK\")>0),A298-MIN(_xlfn.XLOOKUP(\"BLACK\",$D$7:D298,$A$7:A298,\"\",0,-1),_xlfn.XLOOKUP(\"RED\",$D$7:D298,$A$7:A298,\"\",0,-1)),A298-6)","v":1},"","","","","",255,"",50,1]
[{"$f":"ROW()","v":299},8,{"$f":"_xlfn.XLOOKUP(B299,AUX!$A:$A,AUX!$B:$B,\"\",0,1)","v":"BLACK"},{"$f":"IF(C299=0,INDEX($C:$C,MAX(_xlfn.XLOOKUP(\"BLACK\",$C$7:C299,$A$7:A299,\"\",0,-1),_xlfn.XLOOKUP(\"RED\",$C$7:C299,$A$7:A299,\"\",0,-1)),1),C299)","v":"BLACK"},{"$f":"IF(AND(COUNTIF($D$7:D299,\"RED\")>0,COUNTIF($D$7:D299,\"BLACK\")>0),A299-MIN(_xlfn.XLOOKUP(\"BLACK\",$D$7:D299,$A$7:A299,\"\",0,-1),_xlfn.XLOOKUP(\"RED\",$D$7:D299,$A$7:A299,\"\",0,-1)),A299-6)","v":1},"BET","BLACK","SUCCESS",5,10,260,"",50,1]
[{"$f":"ROW()","v":300},1,{"$f":"_xlfn.XLOOKUP(B300,AUX!$A:$A,AUX!$B:$B,\"\",0,1)","v":"RED"},{"$f":"IF(C300=0,INDEX($C:$C,MAX(_xlfn.XLOOKUP(\"BLACK\",$C$7:C300,$A$7:A300,\"\",0,-1),_xlfn.XLOOKUP(\"RED\",$C$7:C300,$A$7:A300,\"\",0,-1)),1),C300)","v":"RED"},{"$f":"IF(AND(COUNTIF($D$7:D300,\"RED\")>0,COUNTIF($D$7:D300,\"BLACK\")>0),A300-MIN(_xlfn.XLOOKUP(\"BLACK\",$D$7:D300,$A$7:A300,\"\",0,-1),_xlfn.XLOOKUP(\"RED\",$D$7:D300,$A$7:A300,\"\",0,-1)),A300-6)","v":1},"BET","RED","SUCCESS",5,10,265,"",50,1]

{"sheet":"RESULTS B","index":2,"n_rows":53,"n_cols":15,"rows_kept":53,"cut":false,"hidden":false,"merged":[]}
[null,50,null,null,null,{"$f":"SUM(F2:F1048576)","v":-230}]
["BET AFTER","BET","STOP LOSS €","STOP PROFIT €","MAX ITER","€ WIN","BALANCE",null,null,"MAX ITER","TIMES"]
[null,null,null,null,null,null,300,null,null,0,{"$f":"COUNTIF(E:E,J3)","v":0}]
[2,5,20,50,8,-25,{"$f":"G3+F4","v":275},null,null,1,{"$f":"COUNTIF(E:E,J4)","v":0}]
[2,5,20,50,10,0,275,null,null,2,0]
[2,5,20,50,10,50,325,null,null,3,0]
[2,5,20,50,7,-20,305,null,null,4,0]
[2,5,20,50,10,5,310,null,null,5,0]
[2,5,20,50,12,-35,275,null,null,6,2]
[2,5,20,50,7,-20,255,null,null,7,11]
[2,5,20,50,12,50,305,null,null,8,11]
[2,5,20,50,8,-30,275,null,null,9,6]
[2,5,20,50,7,-35,240,null,null,10,10]
[2,5,20,50,6,-10,230,null,null,11,6]
[2,5,20,50,7,10,240,null,null,12,2]
[2,5,20,50,11,50,290,null,null,13,2]
[2,5,20,50,8,0,290,null,null,14,0]
[2,5,20,50,10,-35,255,null,null,15,0,null,null,"TIMES BETWEEN 6 AND 10",{"$f":"SUM(K9:K13)","v":40}]
[2,5,20,50,7,5,260,null,null,16,0,null,null,"TIMES > 10",{"$f":"SUM(K14:K23)","v":10}]
[2,5,20,50,7,-35,225,null,null,17,0]
[2,5,20,50,9,-5,220,null,null,18,0]
[2,5,20,50,6,-25,195,null,null,19,0]
[2,5,20,50,9,0,195,null,null,20,0,null,null,"% WINNING PER MONTH VS RISK",{"$f":"F1/'RESULTS B'!D4","v":-4.5999999999999996}]
[2,5,20,50,10,-10,185]
[2,5,20,50,10,-35,150]
[2,5,20,50,10,-30,120]
[2,5,20,50,8,-15,105]
[2,5,20,50,10,-35,70]
[2,5,20,50,9,-25,45]
[2,5,20,50,9,-5,40]
[2,5,20,50,11,-25,15]
[2,5,20,50,7,-20,-5]
[2,5,20,50,10,5,0]
[2,5,20,50,7,50,50]
[2,5,20,50,11,-10,40]
[2,5,20,50,7,0,40]
[2,5,20,50,8,50,90]
[2,5,20,50,13,50,140]
[2,5,20,50,8,-10,130]
[2,5,20,50,11,0,130]
[2,5,20,50,8,-30,100]
[2,5,20,50,7,-5,95]
[2,5,20,50,9,-15,80]
[2,5,20,50,11,50,130]
[2,5,20,50,8,5,135]
[2,5,20,50,8,50,185]
[2,5,20,50,10,-35,150]
[2,5,20,50,9,-10,140]
[2,5,20,50,7,-15,125]
[2,5,20,50,13,-30,95]
[2,5,20,50,8,5,100]
[2,5,20,50,8,-30,70]
[2,5,20,50,11,0,70]