{"text_format":"1","workbook":"xlsx","n_sheets":3,"sheets":["AUX","DASHBOARD B","RESULTS B"],"not_rendered":{"charts":2,"images":2,"macros":1,"external_links":0,"defined_names":1,"comments":1,"pivot_tables":0},"unopened":[],"bounds":{"document_bytes":16777216,"sheet_cells":100000,"rows_first":2000,"rows_last":500,"rows_between":2000,"halvings":0,"cell_chars":16384,"cell_head_chars":4096},"cells_cut":0,"cells_raw":0,"read":"whole","date_system":"1900"}

{"sheet":"AUX","index":0,"n_rows":38,"n_cols":2,"rows_kept":38,"cut":false,"hidden":true,"merged":[]}
["NUMBER","COLOR"]
[0,0]
[1,"RED"]
[2,"BLACK"]
[3,"RED"]
[4,"BLACK"]
[5,"RED"]
[6,"BLACK"]
[7,"RED"]
[8,"BLACK"]
[9,"RED"]
[10,"BLACK"]
[11,"RED"]
[12,"BLACK"]
[13,"RED"]
[14,"BLACK"]
[15,"RED"]
[16,"BLACK"]
[17,"RED"]
[18,"BLACK"]
[19,"RED"]
[20,"BLACK"]
[21,"RED"]
[22,"BLACK"]
[23,"RED"]
[24,"BLACK"]
[25,"RED"]
[26,"BLACK"]
[27,"RED"]
[28,"BLACK"]
[29,"RED"]
[30,"BLACK"]
[31,"RED"]
[32,"BLACK"]
[33,"RED"]
[34,"BLACK"]
[35,"RED"]
[36,"BLACK"]

{"sheet":"DASHBOARD B","index":1,"n_rows":300,"n_cols":38,"rows_kept":300,"cut":false,"hidden":false,"merged":[[0,3,1,3],[0,4,1,4],[0,6,1,6],[0,8,1,8],[0,9,1,9],[0,7,1,7]]}
[null,null,null,"INITIAL BALANCE","BET AFTER ITERATIONS",null,"STOP LOSS ROUND","STOP\nPROFIT €","MAX ITERATIONS",null,null,null,null,null,null,null,null,null,null,0,1,2,3,4,5,6,7,8,9,10,11,12,13,14,15,16,17,18]
[null,null,null,null,null,"BET",null,null,null,null,"WIN","€ WIN","LOSS","€ LOSS","€ BAL",null,null,null,null,{"$f":"COUNTIF($B:$B,T1)","v":8},8,6,12,14,8,5,8,6,12,15,7,8,11,7,2,8,6,8]
[null,null,null,300,1,5,1,200,{"$f":"E3+G3","v":2},null,{"$f":"COUNTIF(H:H,\"SUCCESS\")","v":68},{"$f":"K3*F3","v":340},{"$f":"COUNTIFS(H:H,\"FAIL\",I:I,G4)","v":75},{"$f":"G5*M3","v":375},{"$f":"L3-N3","v":-35},null,null,null,null,null,19,20,21,22,23,24,25,26,27,28,29,30,31,32,33,34,35,36]
[null,null,null,null,null,null,{"$f":"F3*2^(G3-1)","v":5},"CALC",{"$f":"MAX($E$7:$E$300)","v":9},null,null,null,null,null,null,null,null,null,null,null,{"$f":"COUNTIF($B:$B,U3)","v":8},6,6,6,6,8,8,8,10,2,3,7,8,9,11,10,9,10]
[null,null,null,null,null,null,{"$f":"G4*2-F3","v":5},"LOSS"]
["AUX ROW","RESULT","COLOR","SIM ZERO","ITERATIONS","BET","BET SIGN","RESULT","BET AM","WIN","BALANCE","STOPPER","IT CONT","IT ISOL",null,"ITER","TIMES","ISOL TIM"]
[{"$f":"ROW()","v":7},{"$f":"RANDBETWEEN(0,36)","v":21},{"$f":"_xlfn.XLOOKUP(B7,AUX!$A:$A,AUX!$B:$B,\"\",0,1)","v":"RED"},{"$f":"IF(C7=0,INDEX($C:$C,MAX(_xlfn.XLOOKUP(\"BLACK\",$C$7:C7,$A$7:A7,\"\",0,-1),_xlfn.XLOOKUP(\"RED\",$C$7:C7,$A$7:A7,\"\",0,-1)),1),C7)","v":"RED"},null,null,null,null,null,null,{"$f":"D3","v":300},null,{"$f":"E7*20","v":0},{"$f":"IF(E8<=E7,E7,\"\")","v":""},null,0,{"$f":"COUNTIF($E$7:$E$300,P7)","v":0},{"$f":"COUNTIF($N$7:$N$300,P7)","v":0}]
[{"$f":"ROW()","v":8},{"$f":"RANDBETWEEN(0,36)","v":24},{"$f":"_xlfn.XLOOKUP(B8,AUX!$A:$A,AUX!$B:$B,\"\",0,1)","v":"BLACK"},{"$f":"IF(C8=0,INDEX($C:$C,MAX(_xlfn.XLOOKUP(\"BLACK\",$C$7:C8,$A$7:A8,\"\",0,-1),_xlfn.XLOOKUP(\"RED\",$C$7:C8,$A$7:A8,\"\",0,-1)),1),C8)","v":"BLACK"},{"$f":"IF(AND(COUNTIF($D$7:D8,\"RED\")>0,COUNTIF($D$7:D8,\"BLACK\")>0),A8-MIN(_xlfn.XLOOKUP(\"BLACK\",$D$7:D8,$A$7:A8,\"\",0,-1),_xlfn.XLOOKUP(\"RED\",$D$7:D8,$A$7:A8,\"\",0,-1)),A8-6)","v":1},{"$f":"IF(AND(E7>=$E$3,L7=\"\"),\"BET\",\"\")","v":""},{"$f":"IF(F8=\"BET\",IF(D7=\"RED\",\"BLACK\",IF(D7=\"BLACK\",\"RED\",\"ERROR\")),\"\")","v":""},{"$f":"IF(F8=\"BET\",IF(D8=G8,\"SUCCESS\",\"FAIL\"),\"\")","v":""},{"$f":"IF(F8=\"BET\",IF(OR(I7>=$G$4,F7=\"\"),$F$3,IF(AND(F7=\"BET\",H7=\"FAIL\"),I7*2,$F$3)),\"\")","v":""},{"$f":"IF(F8=\"BET\",IF(H8=\"SUCCESS\",I8*2,0),\"\")","v":""},{"$f":"IF(F8=\"BET\",K7-I8+J8,K7)","v":300},{"$f":"IF(OR(AND(H8=\"FAIL\",I8=$G$4),AND(L7=\"STOP\",E8>$E$3)),\"STOP\",\"\")","v":""},{"$f":"E8*50","v":50},{"$f":"IF(E9<=E8,E8,\"\")","v":1},null,1,{"$f":"COUNTIF(E:E,P8)","v":145},{"$f":"COUNTIF($N$7:$N$300,P8)","v":69}]
[{"$f":"ROW()","v":9},23,{"$f":"_xlfn.XLOOKUP(B9,AUX!$A:$A,AUX!$B:$B,\"\",0,1)","v":"RED"},{"$f":"IF(C9=0,INDEX($C:$C,MAX(_xlfn.XLOOKUP(\"BLACK\",$C$7:C9,$A$7:A9,\"\",0,-1),_xlfn.XLOOKUP(\"RED\",$C$7:C9,$A$7:A9,\"\",0,-1)),1),C9)","v":"RED"},{"$f":"IF(AND(COUNTIF($D$7:D9,\"RED\")>0,COUNTIF($D$7:D9,\"BLACK\")>0),A9-MIN(_xlfn.XLOOKUP(\"BLACK\",$D$7:D9,$A$7:A9,\"\",0,-1),_xlfn.XLOOKUP(\"RED\",$D$7:D9,$A$7:A9,\"\",0,-1)),A9-6)","v":1},{"$f":"IF(AND(E8>=$E$3,L8=\"\"),\"BET\",\"\")","v":"BET"},{"$f":"IF(F9=\"BET\",IF(D8=\"RED\",\"BLACK\",IF(D8=\"BLACK\",\"RED\",\"ERROR\")),\"\")","v":"RED"},{"$f":"IF(F9=\"BET\",IF(D9=G9,\"SUCCESS\",\"FAIL\"),\"\")","v":"SUCCESS"},{"$f":"IF(F9=\"BET\",IF(OR(I8>=$G$4,F8=\"\"),$F$3,IF(AND(F8=\"BET\",H8=\"FAIL\"),I8*2,$F$3)),\"\")","v":5},10,305,"",{"$f":"E9*50","v":50},1,null,2,{"$f":"COUNTIF(E:E,P9)","v":75},35]
[{"$f":"ROW()","v":10},4,{"$f":"_xlfn.XLOOKUP(B10,AUX!$A:$A,AUX!$B:$B,\"\",0,1)","v":"BLACK"},{"$f":"IF(C10=0,INDEX($C:$C,MAX(_xlfn.XLOOKUP(\"BLACK\",$C$7:C10,$A$7:A10,\"\",0,-1),_xlfn.XLOOKUP(\"RED\",$C$7:C10,$A$7:A10,\"\",0,-1)),1),C10)","v":"BLACK"},{"$f":"IF(AND(COUNTIF($D$7:D10,\"RED\")>0,COUNTIF($D$7:D10,\"BLACK\")>0),A10-MIN(_xlfn.XLOOKUP(\"BLACK\",$D$7:D10,$A$7:A10,\"\",0,-1),_xlfn.XLOOKUP(\"RED\",$D$7:D10,$A$7:A10,\"\",0,-1)),A10-6)","v":1},"BET",{"$f":"IF(F10=\"BET\",IF(D9=\"RED\",\"BLACK\",IF(D9=\"BLACK\",\"RED\",\"ERROR\")),\"\")","v":"BLACK"},{"$f":"IF(F10=\"BET\",IF(D10=G10,\"SUCCESS\",\"FAIL\"),\"\")","v":"SUCCESS"},{"$f":"IF(F10=\"BET\",IF(OR(I9>=$G$4,F9=\"\"),$F$3,IF(AND(F9=\"BET\",H9=\"FAIL\"),I9*2,$F$3)),\"\")","v":5},{"$f":"IF(F10=\"BET\",IF(H10=\"SUCCESS\",I10*2,0),\"\")","v":10},310,"",50,1,null,3,{"$f":"COUNTIF(E:E,P10)","v":40},20]
[{"$f":"ROW()","v":11},13,{"$f":"_xlfn.XLOOKUP(B11,AUX!$A:$A,AUX!$B:$B,\"\",0,1)","v":"RED"},{"$f":"IF(C11=0,INDEX($C:$C,MAX(_xlfn.XLOOKUP(\"BLACK\",$C$7:C11,$A$7:A11,\"\",0,-1),_xlfn.XLOOKUP(\"RED\",$C$7:C11,$A$7:A11,\"\",0,-1)),1),C11)","v":"RED"},{"$f":"IF(AND(COUNTIF($D$7:D11,\"RED\")>0,COUNTIF($D$7:D11,\"BLACK\")>0),A11-MIN(_xlfn.XLOOKUP(\"BLACK\",$D$7:D11,$A$7:A11,\"\",0,-1),_xlfn.XLOOKUP(\"RED\",$D$7:D11,$A$7:A11,\"\",0,-1)),A11-6)","v":1},"BET","RED","SUCCESS",5,10,315,"",50,"",null,4,{"$f":"COUNTIF(E:E,P11)","v":20},11]
[{"$f":"ROW()","v":12},3,{"$f":"_xlfn.XLOOKUP(B12,AUX!$A:$A,AUX!$B:$B,\"\",0,1)","v":"RED"},{"$f":"IF(C12=0,INDEX($C:$C,MAX(_xlfn.XLOOKUP(\"BLACK\",$C$7:C12,$A$7:A12,\"\",0,-1),_xlfn.XLOOKUP(\"RED\",$C$7:C12,$A$7:A12,\"\",0,-1)),1),C12)","v":"RED"},{"$f":"IF(AND(COUNTIF($D$7:D12,\"RED\")>0,COUNTIF($D$7:D12,\"BLACK\")>0),A12-MIN(_xlfn.XLOOKUP(\"BLACK\",$D$7:D12,$A$7:A12,\"\",0,-1),_xlfn.XLOOKUP(\"RED\",$D$7:D12,$A$7:A12,\"\",0,-1)),A12-6)","v":2},"BET","BLACK","FAIL",5,0,310,"STOP",100,"",null,5,{"$f":"COUNTIF(E:E,P12)","v":9},7]
[{"$f":"ROW()","v":13},3,{"$f":"_xlfn.XLOOKUP(B13,AUX!$A:$A,AUX!$B:$B,\"\",0,1)","v":"RED"},{"$f":"IF(C13=0,INDEX($C:$C,MAX(_xlfn.XLOOKUP(\"BLACK\",$C$7:C13,$A$7:A13,\"\",0,-1),_xlfn.XLOOKUP(\"RED\",$C$7:C13,$A$7:A13,\"\",0,-1)),1),C13)","v":"RED"},{"$f":"IF(AND(COUNTIF($D$7:D13,\"RED\")>0,COUNTIF($D$7:D13,\"BLACK\")>0),A13-MIN(_xlfn.XLOOKUP(\"BLACK\",$D$7:D13,$A$7:A13,\"\",0,-1),_xlfn.XLOOKUP(\"RED\",$D$7:D13,$A$7:A13,\"\",0,-1)),A13-6)","v":3},"","","","","",310,"STOP",150,3,null,6,{"$f":"COUNTIF(E:E,P13)","v":2},1]
[{"$f":"ROW()","v":14},2,{"$f":"_xlfn.XLOOKUP(B14,AUX!$A:$A,AUX!$B:$B,\"\",0,1)","v":"BLACK"},{"$f":"IF(C14=0,INDEX($C:$C,MAX(_xlfn.XLOOKUP(\"BLACK\",$C$7:C14,$A$7:A14,\"\",0,-1),_xlfn.XLOOKUP(\"RED\",$C$7:C14,$A$7:A14,\"\",0,-1)),1),C14)","v":"BLACK"},{"$f":"IF(AND(COUNTIF($D$7:D14,\"RED\")>0,COUNTIF($D$7:D14,\"BLACK\")>0),A14-MIN(_xlfn.XLOOKUP(\"BLACK\",$D$7:D14,$A$7:A14,\"\",0,-1),_xlfn.XLOOKUP(\"RED\",$D$7:D14,$A$7:A14,\"\",0,-1)),A14-6)","v":1},"","","","","",310,"",50,1,null,7,{"$f":"COUNTIF(E:E,P14)","v":1},0]
[{"$f":"ROW()","v":15},1,{"$f":"_xlfn.XLOOKUP(B15,AUX!$A:$A,AUX!$B:$B,\"\",0,1)","v":"RED"},{"$f":"IF(C15=0,INDEX($C:$C,MAX(_xlfn.XLOOKUP(\"BLACK\",$C$7:C15,$A$7:A15,\"\",0,-1),_xlfn.XLOOKUP(\"RED\",$C$7:C15,$A$7:A15,\"\",0,-1)),1),C15)","v":"RED"},{"$f":"IF(AND(COUNTIF($D$7:D15,\"RED\")>0,COUNTIF($D$7:D15,\"BLACK\")>0),A15-MIN(_xlfn.XLOOKUP(\"BLACK\",$D$7:D15,$A$7:A15,\"\",0,-1),_xlfn.XLOOKUP(\"RED\",$D$7:D15,$A$7:A15,\"\",0,-1)),A15-6)","v":1},"BET","RED","SUCCESS",5,10,315,"",50,1,null,8,{"$f":"COUNTIF(E:E,P15)","v":1},0]
[{"$f":"ROW()","v":16},10,{"$f":"_xlfn.XLOOKUP(B16,AUX!$A:$A,AUX!$B:$B,\"\",0,1)","v":"BLACK"},{"$f":"IF(C16=0,INDEX($C:$C,MAX(_xlfn.XLOOKUP(\"BLACK\",$C$7:C16,$A$7:A16,\"\",0,-1),_xlfn.XLOOKUP(\"RED\",$C$7:C16,$A$7:A16,\"\",0,-1)),1),C16)","v":"BLACK"},{"$f":"IF(AND(COUNTIF($D$7:D16,\"RED\")>0,COUNTIF($D$7:D16,\"BLACK\")>0),A16-MIN(_xlfn.XLOOKUP(\"BLACK\",$D$7:D16,$A$7:A16,\"\",0,-1),_xlfn.XLOOKUP(\"RED\",$D$7:D16,$A$7:A16,\"\",0,-1)),A16-6)","v":1},"BET","BLACK","SUCCESS",5,10,320,"",50,1,null,9,{"$f":"COUNTIF(E:E,P16)","v":1},1]
[{"$f":"ROW()","v":17},35,{"$f":"_xlfn.XLOOKUP(B17,AUX!$A:$A,AUX!$B:$B,\"\",0,1)","v":"RED"},{"$f":"IF(C17=0,INDEX($C:$C,MAX(_xlfn.XLOOKUP(\"BLACK\",$C$7:C17,$A$7:A17,\"\",0,-1),_xlfn.XLOOKUP(\"RED\",$C$7:C17,$A$7:A17,\"\",0,-1)),1),C17)","v":"RED"},{"$f":"IF(AND(COUNTIF($D$7:D17,\"RED\")>0,COUNTIF($D$7:D17,\"BLACK\")>0),A17-MIN(_xlfn.XLOOKUP(\"BLACK\",$D$7:D17,$A$7:A17,\"\",0,-1),_xlfn.XLOOKUP(\"RED\",$D$7:D17,$A$7:A17,\"\",0,-1)),A17-6)","v":1},"BET","RED","SUCCESS",5,10,325,"",50,"",null,10,{"$f":"COUNTIF(E:E,P17)","v":0},0]
[{"$f":"ROW()","v":18},5,{"$f":"_xlfn.XLOOKUP(B18,AUX!$A:$A,AUX!$B:$B,\"\",0,1)","v":"RED"},{"$f":"IF(C18=0,INDEX($C:$C,MAX(_xlfn.XLOOKUP(\"BLACK\",$C$7:C18,$A$7:A18,\"\",0,-1),_xlfn.XLOOKUP(\"RED\",$C$7:C18,$A$7:A18,\"\",0,-1)),1),C18)","v":"RED"},{"$f":"IF(AND(COUNTIF($D$7:D18,\"RED\")>0,COUNTIF($D$7:D18,\"BLACK\")>0),A18-MIN(_xlfn.XLOOKUP(\"BLACK\",$D$7:D18,$A$7:A18,\"\",0,-1),_xlfn.XLOOKUP(\"RED\",$D$7:D18,$A$7:A18,\"\",0,-1)),A18-6)","v":2},"BET","BLACK","FAIL",5,0,320,"STOP",100,"",null,11,{"$f":"COUNTIF(E:E,P18)","v":0},0]
[{"$f":"ROW()","v":19},23,{"$f":"_xlfn.XLOOKUP(B19,AUX!$A:$A,AUX!$B:$B,\"\",0,1)","v":"RED"},{"$f":"IF(C19=0,INDEX($C:$C,MAX(_xlfn.XLOOKUP(\"BLACK\",$C$7:C19,$A$7:A19,\"\",0,-1),_xlfn.XLOOKUP(\"RED\",$C$7:C19,$A$7:A19,\"\",0,-1)),1),C19)","v":"RED"},{"$f":"IF(AND(COUNTIF($D$7:D19,\"RED\")>0,COUNTIF($D$7:D19,\"BLACK\")>0),A19-MIN(_xlfn.XLOOKUP(\"BLACK\",$D$7:D19,$A$7:A19,\"\",0,-1),_xlfn.XLOOKUP(\"RED\",$D$7:D19,$A$7:A19,\"\",0,-1)),A19-6)","v":3},"","","","","",320,"STOP",150,3,null,12,{"$f":"COUNTIF(E:E,P19)","v":0},0]
[{"$f":"ROW()","v":20},26,{"$f":"_xlfn.XLOOKUP(B20,AUX!$A:$A,AUX!$B:$B,\"\",0,1)","v":"BLACK"},{"$f":"IF(C20=0,INDEX($C:$C,MAX(_xlfn.XLOOKUP(\"BLACK\",$C$7:C20,$A$7:A20,\"\",0,-1),_xlfn.XLOOKUP(\"RED\",$C$7:C20,$A$7:A20,\"\",0,-1)),1),C20)","v":"BLACK"},{"$f":"IF(AND(COUNTIF($D$7:D20,\"RED\")>0,COUNTIF($D$7:D20,\"BLACK\")>0),A20-MIN(_xlfn.XLOOKUP(\"BLACK\",$D$7:D20,$A$7:A20,\"\",0,-1),_xlfn.XLOOKUP(\"RED\",$D$7:D20,$A$7:A20,\"\",0,-1)),A20-6)","v":1},"","","","","",320,"",50,"",null,13,{"$f":"COUNTIF(E:E,P20)","v":0},0]
[{"$f":"ROW()","v":21},34,{"$f":"_xlfn.XLOOKUP(B21,AUX!$A:$A,AUX!$B:$B,\"\",0,1)","v":"BLACK"},{"$f":"IF(C21=0,INDEX($C:$C,MAX(_xlfn.XLOOKUP(\"BLACK\",$C$7:C21,$A$7:A21,\"\",0,-1),_xlfn.XLOOKUP(\"RED\",$C$7:C21,$A$7:A21,\"\",0,-1)),1),C21)","v":"BLACK"},{"$f":"IF(AND(COUNTIF($D$7:D21,\"RED\")>0,COUNTIF($D$7:D21,\"BLACK\")>0),A21-MIN(_xlfn.XLOOKUP(\"BLACK\",$D$7:D21,$A$7:A21,\"\",0,-1),_xlfn.XLOOKUP(\"RED\",$D$7:D21,$A$7:A21,\"\",0,-1)),A21-6)","v":2},"BET","RED","FAIL",5,0,315,"STOP",100,2,null,14,{"$f":"COUNTIF(E:E,P21)","v":0},0]
[{"$f":"ROW()","v":22},7,{"$f":"_xlfn.XLOOKUP(B22,AUX!$A:$A,AUX!$B:$B,\"\",0,1)","v":"RED"},{"$f":"IF(C22=0,INDEX($C:$C,MAX(_xlfn.XLOOKUP(\"BLACK\",$C$7:C22,$A$7:A22,\"\",0,-1),_xlfn.XLOOKUP(\"RED\",$C$7:C22,$A$7:A22,\"\",0,-1)),1),C22)","v":"RED"},{"$f":"IF(AND(COUNTIF($D$7:D22,\"RED\")>0,COUNTIF($D$7:D22,\"BLACK\")>0),A22-MIN(_xlfn.XLOOKUP(\"BLACK\",$D$7:D22,$A$7:A22,\"\",0,-1),_xlfn.XLOOKUP(\"RED\",$D$7:D22,$A$7:A22,\"\",0,-1)),A22-6)","v":1},"","","","","",315,"",50,1,null,15,{"$f":"COUNTIF(E:E,P22)","v":0},0]
[{"$f":"ROW()","v":23},28,{"$f":"_xlfn.XLOOKUP(B23,AUX!$A:$A,AUX!$B:$B,\"\",0,1)","v":"BLACK"},{"$f":"IF(C23=0,INDEX($C:$C,MAX(_xlfn.XLOOKUP(\"BLACK\",$C$7:C23,$A$7:A23,\"\",0,-1),_xlfn.XLOOKUP(\"RED\",$C$7:C23,$A$7:A23,\"\",0,-1)),1),C23)","v":"BLACK"},{"$f":"IF(AND(COUNTIF($D$7:D23,\"RED\")>0,COUNTIF($D$7:D23,\"BLACK\")>0),A23-MIN(_xlfn.XLOOKUP(\"BLACK\",$D$7:D23,$A$7:A23,\"\",0,-1),_xlfn.XLOOKUP(\"RED\",$D$7:D23,$A$7:A23,\"\",0,-1)),A23-6)","v":1},"BET","BLACK","SUCCESS",5,10,320,"",50,1,null,16,{"$f":"COUNTIF(E:E,P23)","v":0},0]
[{"$f":"ROW()","v":24},13,{"$f":"_xlfn.XLOOKUP(B24,AUX!$A:$A,AUX!$B:$B,\"\",0,1)","v":"RED"},{"$f":"IF(C24=0,INDEX($C:$C,MAX(_xlfn.XLOOKUP(\"BLACK\",$C$7:C24,$A$7:A24,\"\",0,-1),_xlfn.XLOOKUP(\"RED\",$C$7:C24,$A$7:A24,\"\",0,-1)),1),C24)","v":"RED"},{"$f":"IF(AND(COUNTIF($D$7:D24,\"RED\")>0,COUNTIF($D$7:D24,\"BLACK\")>0),A24-MIN(_xlfn.XLOOKUP(\"BLACK\",$D$7:D24,$A$7:A24,\"\",0,-1),_xlfn.XLOOKUP(\"RED\",$D$7:D24,$A$7:A24,\"\",0,-1)),A24-6)","v":1},"BET","RED","SUCCESS",5,10,325,"",50,1,null,17,{"$f":"COUNTIF(E:E,P24)","v":0},0]
[{"$f":"ROW()","v":25},16,{"$f":"_xlfn.XLOOKUP(B25,AUX!$A:$A,AUX!$B:$B,\"\",0,1)","v":"BLACK"},{"$f":"IF(C25=0,INDEX($C:$C,MAX(_xlfn.XLOOKUP(\"BLACK\",$C$7:C25,$A$7:A25,\"\",0,-1),_xlfn.XLOOKUP(\"RED\",$C$7:C25,$A$7:A25,\"\",0,-1)),1),C25)","v":"BLACK"},{"$f":"IF(AND(COUNTIF($D$7:D25,\"RED\")>0,COUNTIF($D$7:D25,\"BLACK\")>0),A25-MIN(_xlfn.XLOOKUP(\"BLACK\",$D$7:D25,$A$7:A25,\"\",0,-1),_xlfn.XLOOKUP(\"RED\",$D$7:D25,$A$7:A25,\"\",0,-1)),A25-6)","v":1},"BET","BLACK","SUCCESS",5,10,330,"",50,"",null,18,{"$f":"COUNTIF(E:E,P25)","v":0},0]
[{"$f":"ROW()","v":26},22,{"$f":"_xlfn.XLOOKUP(B26,AUX!$A:$A,AUX!$B:$B,\"\",0,1)","v":"BLACK"},{"$f":"IF(C26=0,INDEX($C:$C,MAX(_xlfn.XLOOKUP(\"BLACK\",$C$7:C26,$A$7:A26,\"\",0,-1),_xlfn.XLOOKUP(\"RED\",$C$7:C26,$A$7:A26,\"\",0,-1)),1),C26)","v":"BLACK"},{"$f":"IF(AND(COUNTIF($D$7:D26,\"RED\")>0,COUNTIF($D$7:D26,\"BLACK\")>0),A26-MIN(_xlfn.XLOOKUP(\"BLACK\",$D$7:D26,$A$7:A26,\"\",0,-1),_xlfn.XLOOKUP(\"RED\",$D$7:D26,$A$7:A26,\"\",0,-1)),A26-6)","v":2},"BET","RED","FAIL",5,0,325,"STOP",100,2,null,19,{"$f":"COUNTIF(E:E,P26)","v":0},0]
[{"$f":"ROW()","v":27},21,{"$f":"_xlfn.XLOOKUP(B27,AUX!$A:$A,AUX!$B:$B,\"\",0,1)","v":"RED"},{"$f":"IF(C27=0,INDEX($C:$C,MAX(_xlfn.XLOOKUP(\"BLACK\",$C$7:C27,$A$7:A27,\"\",0,-1),_xlfn.XLOOKUP(\"RED\",$C$7:C27,$A$7:A27,\"\",0,-1)),1),C27)","v":"RED"},{"$f":"IF(AND(COUNTIF($D$7:D27,\"RED\")>0,COUNTIF($D$7:D27,\"BLACK\")>0),A27-MIN(_xlfn.XLOOKUP(\"BLACK\",$D$7:D27,$A$7:A27,\"\",0,-1),_xlfn.XLOOKUP(\"RED\",$D$7:D27,$A$7:A27,\"\",0,-1)),A27-6)","v":1},"","","","","",325,"",50,"",null,20,{"$f":"COUNTIF(E:E,P27)","v":0},0]
[{"$f":"ROW()","v":28},23,{"$f":"_xlfn.XLOOKUP(B28,AUX!$A:$A,AUX!$B:$B,\"\",0,1)","v":"RED"},{"$f":"IF(C28=0,INDEX($C:$C,MAX(_xlfn.XLOOKUP(\"BLACK\",$C$7:C28,$A$7:A28,\"\",0,-1),_xlfn.XLOOKUP(\"RED\",$C$7:C28,$A$7:A28,\"\",0,-1)),1),C28)","v":"RED"},{"$f":"IF(AND(COUNTIF($D$7:D28,\"RED\")>0,COUNTIF($D$7:D28,\"BLACK\")>0),A28-MIN(_xlfn.XLOOKUP(\"BLACK\",$D$7:D28,$A$7:A28,\"\",0,-1),_xlfn.XLOOKUP(\"RED\",$D$7:D28,$A$7:A28,\"\",0,-1)),A28-6)","v":2},"BET","BLACK","FAIL",5,0,320,"STOP",100,""]
[{"$f":"ROW()","v":29},5,{"$f":"_xlfn.XLOOKUP(B29,AUX!$A:$A,AUX!$B:$B,\"\",0,1)","v":"RED"},{"$f":"IF(C29=0,INDEX($C:$C,MAX(_xlfn.XLOOKUP(\"BLACK\",$C$7:C29,$A$7:A29,\"\",0,-1),_xlfn.XLOOKUP(\"RED\",$C$7:C29,$A$7:A29,\"\",0,-1)),1),C29)","v":"RED"},{"$f":"IF(AND(COUNTIF($D$7:D29,\"RED\")>0,COUNTIF($D$7:D29,\"BLACK\")>0),A29-MIN(_xlfn.XLOOKUP(\"BLACK\",$D$7:D29,$A$7:A29,\"\",0,-1),_xlfn.XLOOKUP(\"RED\",$D$7:D29,$A$7:A29,\"\",0,-1)),A29-6)","v":3},"","","","","",320,"STOP",150,3]
[{"$f":"ROW()","v":30},34,{"$f":"_xlfn.XLOOKUP(B30,AUX!$A:$A,AUX!$B:$B,\"\",0,1)","v":"BLACK"},{"$f":"IF(C30=0,INDEX($C:$C,MAX(_xlfn.XLOOKUP(\"BLACK\",$C$7:C30,$A$7:A30,\"\",0,-1),_xlfn.XLOOKUP(\"RED\",$C$7:C30,$A$7:A30,\"\",0,-1)),1),C30)","v":"BLACK"},{"$f":"IF(AND(COUNTIF($D$7:D30,\"RED\")>0,COUNTIF($D$7:D30,\"BLACK\")>0),A30-MIN(_xlfn.XLOOKUP(\"BLACK\",$D$7:D30,$A$7:A30,\"\",0,-1),_xlfn.XLOOKUP(\"RED\",$D$7:D30,$A$7:A30,\"\",0,-1)),A30-6)","v":1},"","","","","",320,"",50,1]
[{"$f":"ROW()","v":31},3,{"$f":"_xlfn.XLOOKUP(B31,AUX!$A:$A,AUX!$B:$B,\"\",0,1)","v":"RED"},{"$f":"IF(C31=0,INDEX($C:$C,MAX(_xlfn.XLOOKUP(\"BLACK\",$C$7:C31,$A$7:A31,\"\",0,-1),_xlfn.XLOOKUP(\"RED\",$C$7:C31,$A$7:A31,\"\",0,-1)),1),C31)","v":"RED"},{"$f":"IF(AND(COUNTIF($D$7:D31,\"RED\")>0,COUNTIF($D$7:D31,\"BLACK\")>0),A31-MIN(_xlfn.XLOOKUP(\"BLACK\",$D$7:D31,$A$7:A31,\"\",0,-1),_xlfn.XLOOKUP(\"RED\",$D$7:D31,$A$7:A31,\"\",0,-1)),A31-6)","v":1},"BET","RED","SUCCESS",5,10,325,"",50,""]
[{"$f":"ROW()","v":32},17,{"$f":"_xlfn.XLOOKUP(B32,AUX!$A:$A,AUX!$B:$B,\"\",0,1)","v":"RED"},{"$f":"IF(C32=0,INDEX($C:$C,MAX(_xlfn.XLOOKUP(\"BLACK\",$C$7:C32,$A$7:A32,\"\",0,-1),_xlfn.XLOOKUP(\"RED\",$C$7:C32,$A$7:A32,\"\",0,-1)),1),C32)","v":"RED"},{"$f":"IF(AND(COUNTIF($D$7:D32,\"RED\")>0,COUNTIF($D$7:D32,\"BLACK\")>0),A32-MIN(_xlfn.XLOOKUP(\"BLACK\",$D$7:D32,$A$7:A32,\"\",0,-1),_xlfn.XLOOKUP(\"RED\",$D$7:D32,$A$7:A32,\"\",0,-1)),A32-6)","v":2},"BET","BLACK","FAIL",5,0,320,"STOP",100,""]
[{"$f":"ROW()","v":33},17,{"$f":"_xlfn.XLOOKUP(B33,AUX!$A:$A,AUX!$B:$B,\"\",0,1)","v":"RED"},{"$f":"IF(C33=0,INDEX($C:$C,MAX(_xlfn.XLOOKUP(\"BLACK\",$C$7:C33,$A$7:A33,\"\",0,-1),_xlfn.XLOOKUP(\"RED\",$C$7:C33,$A$7:A33,\"\",0,-1)),1),C33)","v":"RED"},{"$f":"IF(AND(COUNTIF($D$7:D33,\"RED\")>0,COUNTIF($D$7:D33,\"BLACK\")>0),A33-MIN(_xlfn.XLOOKUP(\"BLACK\",$D$7:D33,$A$7:A33,\"\",0,-1),_xlfn.XLOOKUP(\"RED\",$D$7:D33,$A$7:A33,\"\",0,-1)),A33-6)","v":3},"","","","","",320,"STOP",150,""]
[{"$f":"ROW()","v":34},13,{"$f":"_xlfn.XLOOKUP(B34,AUX!$A:$A,AUX!$B:$B,\"\",0,1)","v":"RED"},{"$f":"IF(C34=0,INDEX($C:$C,MAX(_xlfn.XLOOKUP(\"BLACK\",$C$7:C34,$A$7:A34,\"\",0,-1),_xlfn.XLOOKUP(\"RED\",$C$7:C34,$A$7:A34,\"\",0,-1)),1),C34)","v":"RED"},{"$f":"IF(AND(COUNTIF($D$7:D34,\"RED\")>0,COUNTIF($D$7:D34,\"BLACK\")>0),A34-MIN(_xlfn.XLOOKUP(\"BLACK\",$D$7:D34,$A$7:A34,\"\",0,-1),_xlfn.XLOOKUP(\"RED\",$D$7:D34,$A$7:A34,\"\",0,-1)),A34-6)","v":4},"","","","","",320,"STOP",200,4]
[{"$f":"ROW()","v":35},32,{"$f":"_xlfn.XLOOKUP(B35,AUX!$A:$A,AUX!$B:$B,\"\",0,1)","v":"BLACK"},{"$f":"IF(C35=0,INDEX($C:$C,MAX(_xlfn.XLOOKUP(\"BLACK\",$C$7:C35,$A$7:A35,\"\",0,-1),_xlfn.XLOOKUP(\"RED\",$C$7:C35,$A$7:A35,\"\",0,-1)),1),C35)","v":"BLACK"},{"$f":"IF(AND(COUNTIF($D$7:D35,\"RED\")>0,COUNTIF($D$7:D35,\"BLACK\")>0),A35-MIN(_xlfn.XLOOKUP(\"BLACK\",$D$7:D35,$A$7:A35,\"\",0,-1),_xlfn.XLOOKUP(\"RED\",$D$7:D35,$A$7:A35,\"\",0,-1)),A35-6)","v":1},"","","","","",320,"",50,""]
[{"$f":"ROW()","v":36},4,{"$f":"_xlfn.XLOOKUP(B36,AUX!$A:$A,AUX!$B:$B,\"\",0,1)","v":"BLACK"},{"$f":"IF(C36=0,INDEX($C:$C,MAX(_xlfn.XLOOKUP(\"BLACK\",$C$7:C36,$A$7:A36,\"\",0,-1),_xlfn.XLOOKUP(\"RED\",$C$7:C36,$A$7:A36,\"\",0,-1)),1),C36)","v":"BLACK"},{"$f":"IF(AND(COUNTIF($D$7:D36,\"RED\")>0,COUNTIF($D$7:D36,\"BLACK\")>0),A36-MIN(_xlfn.XLOOKUP(\"BLACK\",$D$7:D36,$A$7:A36,\"\",0,-1),_xlfn.XLOOKUP(\"RED\",$D$7:D36,$A$7:A36,\"\",0,-1)),A36-6)","v":2},"BET","RED","FAIL",5,0,315,"STOP",100,""]
[{"$f":"ROW()","v":37},26,{"$f":"_xlfn.XLOOKUP(B37,AUX!$A:$A,AUX!$B:$B,\"\",0,1)","v":"BLACK"},{"$f":"IF(C37=0,INDEX($C:$C,MAX(_xlfn.XLOOKUP(\"BLACK\",$C$7:C37,$A$7:A37,\"\",0,-1),_xlfn.XLOOKUP(\"RED\",$C$7:C37,$A$7:A37,\"\",0,-1)),1),C37)","v":"BLACK"},{"$f":"IF(AND(COUNTIF($D$7:D37,\"RED\")>0,COUNTIF($D$7:D37,\"BLACK\")>0),A37-MIN(_xlfn.XLOOKUP(\"BLACK\",$D$7:D37,$A$7:A37,\"\",0,-1),_xlfn.XLOOKUP(\"RED\",$D$7:D37,$A$7:A37,\"\",0,-1)),A37-6)","v":3},"","","","","",315,"STOP",150,3]
[{"$f":"ROW()","v":38},35,{"$f":"_xlfn.XLOOKUP(B38,AUX!$A:$A,AUX!$B:$B,\"\",0,1)","v":"RED"},{"$f":"IF(C38=0,INDEX($C:$C,MAX(_xlfn.XLOOKUP(\"BLACK\",$C$7:C38,$A$7:A38,\"\",0,-1),_xlfn.XLOOKUP(\"RED\",$C$7:C38,$A$7:A38,\"\",0,-1)),1),C38)","v":"RED"},{"$f":"IF(AND(COUNTIF($D$7:D38,\"RED\")>0,COUNTIF($D$7:D38,\"BLACK\")>0),A38-MIN(_xlfn.XLOOKUP(\"BLACK\",$D$7:D38,$A$7:A38,\"\",0,-1),_xlfn.XLOOKUP(\"RED\",$D$7:D38,$A$7:A38,\"\",0,-1)),A38-6)","v":1},"","","","","",315,"",50,1]
[{"$f":"ROW()","v":39},12,{"$f":"_xlfn.XLOOKUP(B39,AUX!$A:$A,AUX!$B:$B,\"\",0,1)","v":"BLACK"},{"$f":"IF(C39=0,INDEX($C:$C,MAX(_xlfn.XLOOKUP(\"BLACK\",$C$7:C39,$A$7:A39,\"\",0,-1),_xlfn.XLOOKUP(\"RED\",$C$7:C39,$A$7:A39,\"\",0,-1)),1),C39)","v":"BLACK"},{"$f":"IF(AND(COUNTIF($D$7:D39,\"RED\")>0,COUNTIF($D$7:D39,\"BLACK\")>0),A39-MIN(_xlfn.XLOOKUP(\"BLACK\",$D$7:D39,$A$7:A39,\"\",0,-1),_xlfn.XLOOKUP(\"RED\",$D$7:D39,$A$7:A39,\"\",0,-1)),A39-6)","v":1},"BET","BLACK","SUCCESS",5,10,320,"",50,""]
[{"$f":"ROW()","v":40},20,{"$f":"_xlfn.XLOOKUP(B40,AUX!$A:$A,AUX!$B:$B,\"\",0,1)","v":"BLACK"},{"$f":"IF(C40=0,INDEX($C:$C,MAX(_xlfn.XLOOKUP(\"BLACK\",$C$7:C40,$A$7:A40,\"\",0,-1),_xlfn.XLOOKUP(\"RED\",$C$7:C40,$A$7:A40,\"\",0,-1)),1),C40)","v":"BLACK"},{"$f":"IF(AND(COUNTIF($D$7:D40,\"RED\")>0,COUNTIF($D$7:D40,\"BLACK\")>0),A40-MIN(_xlfn.XLOOKUP(\"BLACK\",$D$7:D40,$A$7:A40,\"\",0,-1),_xlfn.XLOOKUP(\"RED\",$D$7:D40,$A$7:A40,\"\",0,-1)),A40-6)","v":2},"BET","RED","FAIL",5,0,315,"STOP",100,""]
{"$rows_left_out":261}
{"sheet":"RESULTS B","index":2,"n_rows":53,"n_cols":15,"rows_kept":53,"cut":false,"hidden":false,"merged":[]}
[null,50,null,null,null,{"$f":"SUM(F2:F1048576)","v":-230}]
["BET AFTER","BET","STOP LOSS €","STOP PROFIT €","MAX ITER","€ WIN","BALANCE",null,null,"MAX ITER","TIMES"]
[null,null,null,null,null,null,300,null,null,0,{"$f":"COUNTIF(E:E,J3)","v":0}]
[2,5,20,50,8,-25,{"$f":"G3+F4","v":275},null,null,1,{"$f":"COUNTIF(E:E,J4)","v":0}]
[2,5,20,50,10,0,275,null,null,2,0]
[2,5,20,50,10,50,325,null,null,3,0]
[2,5,20,50,7,-20,305,null,null,4,0]
[2,5,20,50,10,5,310,null,null,5,0]
[2,5,20,50,12,-35,275,null,null,6,2]
[2,5,20,50,7,-20,255,null,null,7,11]
[2,5,20,50,12,50,305,null,null,8,11]
[2,5,20,50,8,-30,275,null,null,9,6]
[2,5,20,50,7,-35,240,null,null,10,10]
[2,5,20,50,6,-10,230,null,null,11,6]
[2,5,20,50,7,10,240,null,null,12,2]
[2,5,20,50,11,50,290,null,null,13,2]
[2,5,20,50,8,0,290,null,null,14,0]
[2,5,20,50,10,-35,255,null,null,15,0,null,null,"TIMES BETWEEN 6 AND 10",{"$f":"SUM(K9:K13)","v":40}]
[2,5,20,50,7,5,260,null,null,16,0,null,null,"TIMES > 10",{"$f":"SUM(K14:K23)","v":10}]
[2,5,20,50,7,-35,225,null,null,17,0]
[2,5,20,50,9,-5,220,null,null,18,0]
[2,5,20,50,6,-25,195,null,null,19,0]
[2,5,20,50,9,0,195,null,null,20,0,null,null,"% WINNING PER MONTH VS RISK",{"$f":"F1/'RESULTS B'!D4","v":-4.5999999999999996}]
[2,5,20,50,10,-10,185]
[2,5,20,50,10,-35,150]
[2,5,20,50,10,-30,120]
[2,5,20,50,8,-15,105]
[2,5,20,50,10,-35,70]
[2,5,20,50,9,-25,45]
[2,5,20,50,9,-5,40]
[2,5,20,50,11,-25,15]
[2,5,20,50,7,-20,-5]
[2,5,20,50,10,5,0]
[2,5,20,50,7,50,50]
[2,5,20,50,11,-10,40]
[2,5,20,50,7,0,40]
[2,5,20,50,8,50,90]
[2,5,20,50,13,50,140]
[2,5,20,50,8,-10,130]
[2,5,20,50,11,0,130]
{"$rows_left_out":13}